{"text_format":"3","workbook":"xlsx","n_sheets":17,"sheets":["Foglio Informativo","prospetto 1","(segue) prospetto 1","prospetto 2","(segue) prospetto 2","prospetto 4.1","prospetto 4.2","prospetto 5","prospetto 5.1","prospetto 5.2","prospetto 5.3a","prospetto 5.3b","prospetto 5.4","prospetto 6","prospetto 7.1","prospetto 7.2","Foglio2"],"not_rendered":{"images":1,"macros":1,"defined_names":150},"read":"whole","date_system":"1900"}

{"sheet":"Foglio Informativo","index":0,"n_rows":39,"n_cols":11,"rows_kept":39,"merged":[[0,2,0,9],[3,2,3,8],[8,4,8,8],[9,4,9,8],[10,4,10,8],[11,4,11,8]]}
[null,null,"ANTICIPAZIONI DATI DI BILANCIO"]
[]
[null,null,"Società:",{"$nulls":6},"Codice"]
[null,null," << Fare click per selezionare la compagnia >> ",{"$nulls":6},"   "]
[]
[null,null,"Esercizio","2019"]
[]
[null,null,"REFERENTE:"]
[null,null,"Nominativo"]
[null,null,"Telefono"]
[null,null,"FAX"]
[null,null,"indirizzo e-mail"]
[]
[]
[{"$nulls":10},0]
[{"$nulls":10},0]
[{"$nulls":10},0]
[{"$nulls":10},0]
[{"$nulls":10},0]
[]
[{"$nulls":10},0]
[{"$nulls":10},0]
[{"$nulls":10},0]
[{"$nulls":10},0]
[{"$nulls":10},0]
[]
[]
[{"$nulls":10},0]
[{"$nulls":10},0]
[{"$nulls":10},0]
[{"$nulls":10},0]
[]
[{"$nulls":10},0]
[{"$nulls":10},0]
[{"$nulls":10},0]
[{"$nulls":10},0]
[{"$nulls":10},0]
[{"$nulls":10},0]
[{"$nulls":10},0]

{"sheet":"prospetto 1","index":1,"n_rows":95,"n_cols":9,"rows_kept":95,"merged":[[4,0,4,1],[7,1,7,6],[8,1,8,6],[11,1,11,6],[13,0,13,6],[27,2,27,5],[28,2,28,5],[31,0,31,2],[48,0,48,5],[50,0,50,4],[51,0,51,4],[52,0,52,4],[53,0,53,4],[54,0,54,5],[55,0,55,4],[56,0,56,4],[57,0,57,4],[60,1,60,8],[64,0,64,1],[66,0,66,8],[68,0,68,4],[72,0,72,2],[80,1,80,2],[88,0,88,2],[91,0,91,3],[92,3,92,4],[92,7,92,8],[98,0,98,3],[99,3,99,4],[99,7,99,8]]}
[{"$nulls":8},"Prospetto 1"]
["Impresa ",null,{"$f":"IF(ISERROR('Foglio Informativo'!C4),\"\",'Foglio Informativo'!C4)","v":" << Fare click per selezionare la compagnia >> "},{"$nulls":5},{"$f":"IF('Foglio Informativo'!J4 = 0,\"\",'Foglio Informativo'!J4)","v":"   "}]
[null,null,"(denominazione)",{"$nulls":5},"(codice)"]
[null,null,"RAMI DANNI - Esercizio  ",null,{"$f":"'Foglio Informativo'!D6","v":"2019"}]
["Sez. A",null," ",{"$nulls":5},"(Valori in migliaia di Euro)"]
[]
["Margine di solvibilità disponibile (Prospetto margine voce 105)",{"$nulls":6},1]
["di cui:","- Totale azioni preferenziali cumulative e passività subordinate (Prospetto margine voce 66)",{"$nulls":5},{"$f":"H7+1","v":2}]
[null,"- Totale elementi B (Prospetto margine voce 79)",{"$nulls":5},41]
["Margine di solvibilità richiesto (Prospetto margine voce 104)",{"$nulls":6},3]
["Patrimonio netto (Stato Patrimoniale voce 110) (*)",{"$nulls":6},{"$f":"H10+1","v":4},0]
["di cui:","Capitale sociale sottoscritto o fondo equivalente (Stato Patrimoniale voce 101) (*)",{"$nulls":5},{"$f":"H11+1","v":5},0]
[null,"Riserve patrimoniali (Stato Patrimoniale voci da  102 a 107) (*)",{"$nulls":5},{"$f":"H12+1","v":6},0]
["Indebitamento finanziario (Stato Patrimoniale voci 111+141+142+143+144) (*)",{"$nulls":6},42,0]
["Riserve tecniche (Stato Patrimoniale voce 117) (*)",{"$nulls":6},7,0]
["di cui: ",null,"Riserva premi (Stato Patrimoniale voce 112) (*)",{"$nulls":4},{"$f":"H15+1","v":8},0]
[null,null,"Riserva sinistri (Stato Patrimoniale voce 113) (*)",{"$nulls":4},{"$f":"H16+1","v":9},0]
["Totale attivo  (Stato Patrimoniale voce 100)",{"$nulls":6},43,0]
["Totale investimenti (Stato Patrimoniale voci 54) (*)",{"$nulls":6},14,0]
["di cui (**):",null,"Terreni e fabbricati",{"$nulls":4},{"$f":"H19+1","v":15},0]
[null,null,"Azioni e quote di imprese",{"$nulls":4},{"$f":"H20+1","v":16},0]
[null,null,"di cui : non destinate a permanere durevolmente nel patrimonio dell'impresa",{"$nulls":4},44,0]
[null,null,"di cui : Azioni e quote di imprese del gruppo e altre partecipate",{"$nulls":4},{"$f":"H22+1","v":45},0]
[null,null,"Obbligazioni e altri titoli a reddito fisso",{"$nulls":4},17,0]
[null,null,"di cui : non destinate a permanere durevolmente nel patrimonio dell'impresa",{"$nulls":4},46,0]
[null,null,"di cui: Obbligazioni emesse da imprese del gruppo e altre partecipate ",{"$nulls":4},{"$f":"H25+1","v":47},0]
[null,null,"di cui: Titoli di debito emessi o garantiti da Stati dell'Unione Europea compresi nella classe C.III.3",{"$nulls":4},84]
[null,null,"           di cui: Titoli di debito emessi o garantiti da Stati dell'Unione Europea compresi nella\n           classe C.III.3 non destinati a permanere durevolmente nel patrimonio dell'impresa",{"$nulls":4},85]
[null,null,"           di cui: Titoli di debito emessi o garantiti da Stati dell'Unione Europea compresi nella\n           classe C.III.3 destinati a permanere durevolmente nel patrimonio dell'impresa",{"$nulls":4},86]
[null,null,"Quote di fondi comuni di investimento",{"$nulls":4},18,0]
[null,null,"di cui : non destinate a permanere durevolmente nel patrimonio dell'impresa",{"$nulls":4},48,0]
["Disponibilità liquide (voce 90)",{"$nulls":6},{"$f":"H31+1","v":49},0]
["Riserve tecniche a carico dei riassicuratori (Stato Patrimoniale voce 62) (*)",{"$nulls":6},{"$f":"H32+1","v":50},0]
["Premi lordi contabilizzati (Conto economico voce 1)",{"$nulls":6},22,{"$f":"I35+I38","v":0}]
["di cui:","portafoglio italiano:",{"$nulls":5},{"$f":"H34+1","v":23},{"$f":"SUM(I36,I37)","v":0}]
[null,null,"lavoro diretto ",{"$nulls":4},24,0]
[null,null,"lavoro indiretto ",{"$nulls":4},25,0]
[null,"portafoglio estero:",{"$nulls":5},26,{"$f":"SUM(I39:I40)","v":0}]
[null,null,"lavoro diretto ",{"$nulls":4},27,0]
[null,null,"lavoro indiretto ",{"$nulls":4},28,0]
["Premi ceduti in riassicurazione (Conto economico voce 2)",{"$nulls":6},29,0]
["di cui:","Premi ceduti - portafoglio diretto italiano (Allegato 26 voce 11)",{"$nulls":5},30,0]
["Provvigioni di acquisizione (Conto economico voce 20)",{"$nulls":6},31,0]
["Altre spese di acquisizione (Conto economico voce 21)",{"$nulls":6},32,0]
["Provvigioni di incasso (Conto economico voce 23)",{"$nulls":6},33,0]
["Altre spese di amministrazione (Conto economico voce 24)",{"$nulls":6},34,0]
["Ramo r.c.autoveicoli terrestri e r.c.veicoli marittimi, "]
["lacustri e fluviali (rami 10 + 12) - Portafoglio italiano:"]
["   Premi diretti dell'esercizio e degli esercizi precedenti incassati nell'esercizio (modulo 17 voce 206)",{"$nulls":6},51,0]
["   Riserva premi del lavoro diretto (modulo 17 voce 4)",{"$nulls":6},35,0]
["   Riserva sinistri del lavoro diretto alla chiusura dell'esercizio per \n   sinistri dell'esercizio (modulo 17 voci 13)",{"$nulls":6},{"$f":"H50+1","v":36},0]
["   Riserva sinistri del lavoro diretto alla chiusura dell'esercizio \n   precedente (modulo 17 voci 21+ 22)",{"$nulls":6},{"$f":"H51+1","v":37},0]
["   Importi pagati per sinistri di esercizi precedenti (modulo 17 voce 26)",{"$nulls":6},{"$f":"H52+1","v":38},0]
["   Riserva sinistri del lavoro diretto alla chiusura dell'esercizio per \n   sinistri di esercizi precedenti (modulo 17 voce 29)",{"$nulls":6},{"$f":"H53+1","v":39},0]
["   Somme recuperate  e da recuperare di competenza da assicurati e da terzi  (modulo 17 voce 34)",{"$nulls":6},52,0]
["   Risultato del conto tecnico del lavoro diretto (modulo 17 voce 58)",{"$nulls":6},40,0]
["   Altri proventi tecnici (allegato 1 al modulo 17 voce 87)",{"$nulls":6},68,0]
["   Altri oneri tecnici (allegato 1 al modulo 17 voce 88)",{"$nulls":6},69,0]
[]
[]
["(*) ","Per le imprese che esercitano congiuntamente i rami danni e vita dovrà essere riportata la voce corrispondente "]
[null,"dell'All.1 alla Nota integrativa"]
["(**) ","Tale dettaglio (voci 15, 16, 17, 18) è relativo agli investimenti di cui alla voce 54 dello Stato Patrimoniale (o "]
[null,"Allegato 1 alla Nota integrativa). "]
["Sez. B"]
[]
["Informazioni relative ai titoli di debito emessi o garantiti dal Stati dell'Unione Europea non destinati a permanere durevolmente nel patrimonio dell'impresa (decreto legge 29 dicembre 2011, n. 216, convertito con la legge 24 febbraio 2012, n. 14 che ha modificato il decreto legge 29 novembre 2008 convertito con la legge 28 gennaio 2009, n. 2)"]
[]
["L'impresa si è avvalsa della facoltà prevista dal Regolamento ISVAP n. 43 del 12 luglio 2012 (art. 4, comma 1),  che ha dato attuazione alle disposizioni del decreto legge 29 dicembre 2011, n. 216 convertito con la legge 24 febbraio 2012, n. 14 (che ha modificato il decreto legge 29 novembre 2008 convertito con la legge 28 gennaio 2009, n. 2), di valutare i titoli di debito emessi o garantiti da Stati dell'UE compresi nella classe C.III dello Stato Patrimoniale Attivo, non destinati a permanere durevolmente nel proprio patrimonio, all'ultimo valore approvato ai sensi del Regolamento ISVAP n. 22 del 4 aprile 2008, ovvero, per i titoli non presenti in portafoglio a tale data, al costo d'acquisizione, salvo perdite di carattere durevole, rispetto alla data del 31 dicembre 2015 (indicare SI=1 NO=0)."]
[{"$nulls":5},{"$f":"H55+1","v":53}]
[]
[]
["A) Riserva indisponibile pari all'ammontare della differenza tra i valori iscritti in bilancio dei titoli di debito emessi o garantiti da Stati dell'UE compresi nella classe C.III dello Stato Patrimoniale Attivo per i quali è esercitata la facoltà di cui all'art. 4, comma 1, del Regolamento ISVAP n. 43 del 12 luglio 2012 ed i relativi valori desumibili dall'andamento dei mercati al 31 dicembre 2015 (Regolamento ISVAP n. 43, art. 5)"]
[]
[null,null,"- al lordo degli oneri fiscali",{"$f":"F70+1","v":54}]
[]
[]
[null,null,"- al netto degli oneri fiscali",{"$f":"D75+1","v":55}]
[]
[]
[null,"La riserva indisponibile, al netto degli oneri fiscali, è costituita da:"]
[null,null,"    - utili dell'esercizio",{"$f":"D78+1","v":56}]
[]
[null,null,"    - riserve di utili disponibili",{"$f":"D82+1","v":57}]
[]
[null,null,"    - utili degli esercizi successivi",{"$f":"D84+1","v":58}]
[]
[]
["- di cui riserva utilizzata ai fini del calcolo del margine di solvibilità disponibile\n  (Allegato n. 4 al prospetto del margine, voce 1)",null,null,{"$f":"D86+1","v":59}]
[]
[]
["B) Titoli di debito emessi o garantiti da Stati dell'UE non destinati a permanere durevolmente nel proprio patrimonio compresi nella classe C.III dello Stato Patrimoniale Attivo  per i quali l'impresa si è avvalsa della facoltà concessa dall'art. 4, comma 1, del Regolamento ISVAP n. 43  di valutarli all'ultimo valore approvato, ovvero, per i titoli non presenti nel portafoglio a tale data, al costo d'acquisizione, salvo perdite di carattere durevole, rispetto al valore desumibile dall'andamento dei mercati al 31 dicembre 2015."]
[{"$nulls":3},"Valori di bilancio",{"$nulls":3},"Valori di realizzazione desumibili\ndall'andamento dei mercati\nal 31 dicembre 2015"]
[]
[null,null,"-  Titoli di debito emessi o garantiti da Stati dell'UE non destinati a permanere durevolmente nel proprio patrimonio compresi nella classe C.III dello Stato Patrimoniale Attivo",112,{"$nulls":3},{"$f":"D95+1","v":113}]

{"sheet":"(segue) prospetto 1","index":2,"n_rows":1011,"n_cols":7,"rows_kept":1011,"hidden":true,"merged":[[7,1,7,7],[9,1,10,1],[9,2,10,2],[9,3,10,3],[9,4,10,4],[9,5,9,6],[1012,1,1012,2]]}
[null," ",{"$nulls":4},"(segue) Prospetto 1"]
[null,"Impresa ",{"$f":"IF(ISERROR('Foglio Informativo'!C4),\"\",'Foglio Informativo'!C4)","v":" << Fare click per selezionare la compagnia >> "},{"$nulls":3},{"$f":"IF('Foglio Informativo'!J4 = 0,\"\",'Foglio Informativo'!J4)","v":"   "}]
[null,null,"(denominazione)",{"$nulls":3},"(codice)"]
[]
[null,"Sez. B",{"$nulls":4},"(Valori in migliaia di Euro)"]
[]
[]
[null,"C) Titoli di emittenti di cui è stata dichiarata l'insolvenza o per i quali sono state avviate procedure concursuali (es. Lehman Brothers) "]
[null,"* i titoli devono essere riportati nell'elenco, in ordine decrescente, sulla base dell'esposizione totale di ogni singolo emittente "]
[null,"denominazione emittente *","denominazione titolo","Codice ISIN","Valori di bilancio","Tasso di recupero (recovery rate) utilizzato per la valutazione di bilancio"]
[{"$nulls":5},"Parte intera","Parte decimale"]
[{"$nulls":4},0,0,0]
[{"$nulls":4},0,0,0]
[{"$nulls":4},0,0,0]
[{"$nulls":4},0,0,0]
[{"$nulls":4},0,0,0]
[{"$nulls":4},0,0,0]
[{"$nulls":4},0,0,0]
[{"$nulls":4},0,0,0]
[{"$nulls":4},0,0,0]
[{"$nulls":4},0,0,0]
[{"$nulls":4},0,0,0]
[{"$nulls":4},0,0,0]
[{"$nulls":4},0,0,0]
[{"$nulls":4},0,0,0]
[{"$nulls":4},0,0,0]
[{"$nulls":4},0,0,0]
[{"$nulls":4},0,0,0]
[{"$nulls":4},0,0,0]
[{"$nulls":4},0,0,0]
[{"$nulls":4},0,0,0]
[{"$nulls":4},0,0,0]
[{"$nulls":4},0,0,0]
[{"$nulls":4},0,0,0]
[{"$nulls":4},0,0,0]
[{"$nulls":4},0,0,0]
[{"$nulls":4},0,0,0]
[{"$nulls":4},0,0,0]
[{"$nulls":4},0,0,0]
[{"$nulls":4},0,0,0]
[{"$nulls":4},0,0,0]
[{"$nulls":4},0,0,0]
[{"$nulls":4},0,0,0]
[{"$nulls":4},0,0,0]
[{"$nulls":4},0,0,0]
[{"$nulls":4},0,0,0]
[{"$nulls":4},0,0,0]
[{"$nulls":4},0,0,0]
[{"$nulls":4},0,0,0]
[{"$nulls":4},0,0,0]
[{"$nulls":4},0,0,0]
[{"$nulls":4},0,0,0]
[{"$nulls":4},0,0,0]
[{"$nulls":4},0,0,0]
[{"$nulls":4},0,0,0]
[{"$nulls":4},0,0,0]
[{"$nulls":4},0,0,0]
[{"$nulls":4},0,0,0]
[{"$nulls":4},0,0,0]
[{"$nulls":4},0,0,0]
[{"$nulls":4},0,0,0]
[{"$nulls":4},0,0,0]
[{"$nulls":4},0,0,0]
[{"$nulls":4},0,0,0]
[{"$nulls":4},0,0,0]
[{"$nulls":4},0,0,0]
[{"$nulls":4},0,0,0]
[{"$nulls":4},0,0,0]
[{"$nulls":4},0,0,0]
[{"$nulls":4},0,0,0]
[{"$nulls":4},0,0,0]
[{"$nulls":4},0,0,0]
[{"$nulls":4},0,0,0]
[{"$nulls":4},0,0,0]
[{"$nulls":4},0,0,0]
[{"$nulls":4},0,0,0]
[{"$nulls":4},0,0,0]
[{"$nulls":4},0,0,0]
[{"$nulls":4},0,0,0]
[{"$nulls":4},0,0,0]
[{"$nulls":4},0,0,0]
[{"$nulls":4},0,0,0]
[{"$nulls":4},0,0,0]
[{"$nulls":4},0,0,0]
[{"$nulls":4},0,0,0]
[{"$nulls":4},0,0,0]
[{"$nulls":4},0,0,0]
[{"$nulls":4},0,0,0]
[{"$nulls":4},0,0,0]
[{"$nulls":4},0,0,0]
[{"$nulls":4},0,0,0]
[{"$nulls":4},0,0,0]
[{"$nulls":4},0,0,0]
[{"$nulls":4},0,0,0]
[{"$nulls":4},0,0,0]
[{"$nulls":4},0,0,0]
[{"$nulls":4},0,0,0]
[{"$nulls":4},0,0,0]
[{"$nulls":4},0,0,0]
[{"$nulls":4},0,0,0]
[{"$nulls":4},0,0,0]
[{"$nulls":4},0,0,0]
[{"$nulls":4},0,0,0]
[{"$nulls":4},0,0,0]
[{"$nulls":4},0,0,0]
[{"$nulls":4},0,0,0]
[{"$nulls":4},0,0,0]
[{"$nulls":4},0,0,0]
[{"$nulls":4},0,0,0]
[{"$nulls":4},0,0,0]
[{"$nulls":4},0,0,0]
[{"$nulls":4},0,0,0]
[{"$nulls":4},0,0,0]
[{"$nulls":4},0,0,0]
[{"$nulls":4},0,0,0]
[{"$nulls":4},0,0,0]
[{"$nulls":4},0,0,0]
[{"$nulls":4},0,0,0]
[{"$nulls":4},0,0,0]
[{"$nulls":4},0,0,0]
[{"$nulls":4},0,0,0]
[{"$nulls":4},0,0,0]
[{"$nulls":4},0,0,0]
[{"$nulls":4},0,0,0]
[{"$nulls":4},0,0,0]
[{"$nulls":4},0,0,0]
[{"$nulls":4},0,0,0]
[{"$nulls":4},0,0,0]
[{"$nulls":4},0,0,0]
[{"$nulls":4},0,0,0]
[{"$nulls":4},0,0,0]
[{"$nulls":4},0,0,0]
[{"$nulls":4},0,0,0]
[{"$nulls":4},0,0,0]
[{"$nulls":4},0,0,0]
[{"$nulls":4},0,0,0]
[{"$nulls":4},0,0,0]
[{"$nulls":4},0,0,0]
[{"$nulls":4},0,0,0]
[{"$nulls":4},0,0,0]
[{"$nulls":4},0,0,0]
[{"$nulls":4},0,0,0]
[{"$nulls":4},0,0,0]
[{"$nulls":4},0,0,0]
[{"$nulls":4},0,0,0]
[{"$nulls":4},0,0,0]
[{"$nulls":4},0,0,0]
[{"$nulls":4},0,0,0]
[{"$nulls":4},0,0,0]
[{"$nulls":4},0,0,0]
[{"$nulls":4},0,0,0]
[{"$nulls":4},0,0,0]
[{"$nulls":4},0,0,0]
[{"$nulls":4},0,0,0]
[{"$nulls":4},0,0,0]
[{"$nulls":4},0,0,0]
[{"$nulls":4},0,0,0]
[{"$nulls":4},0,0,0]
[{"$nulls":4},0,0,0]
[{"$nulls":4},0,0,0]
[{"$nulls":4},0,0,0]
[{"$nulls":4},0,0,0]
[{"$nulls":4},0,0,0]
[{"$nulls":4},0,0,0]
[{"$nulls":4},0,0,0]
[{"$nulls":4},0,0,0]
[{"$nulls":4},0,0,0]
[{"$nulls":4},0,0,0]
[{"$nulls":4},0,0,0]
[{"$nulls":4},0,0,0]
[{"$nulls":4},0,0,0]
[{"$nulls":4},0,0,0]
[{"$nulls":4},0,0,0]
[{"$nulls":4},0,0,0]
[{"$nulls":4},0,0,0]
[{"$nulls":4},0,0,0]
[{"$nulls":4},0,0,0]
[{"$nulls":4},0,0,0]
[{"$nulls":4},0,0,0]
[{"$nulls":4},0,0,0]
[{"$nulls":4},0,0,0]
[{"$nulls":4},0,0,0]
[{"$nulls":4},0,0,0]
[{"$nulls":4},0,0,0]
[{"$nulls":4},0,0,0]
[{"$nulls":4},0,0,0]
[{"$nulls":4},0,0,0]
[{"$nulls":4},0,0,0]
[{"$nulls":4},0,0,0]
[{"$nulls":4},0,0,0]
[{"$nulls":4},0,0,0]
[{"$nulls":4},0,0,0]
[{"$nulls":4},0,0,0]
[{"$nulls":4},0,0,0]
[{"$nulls":4},0,0,0]
[{"$nulls":4},0,0,0]
[{"$nulls":4},0,0,0]
[{"$nulls":4},0,0,0]
[{"$nulls":4},0,0,0]
[{"$nulls":4},0,0,0]
[{"$nulls":4},0,0,0]
[{"$nulls":4},0,0,0]
[{"$nulls":4},0,0,0]
[{"$nulls":4},0,0,0]
[{"$nulls":4},0,0,0]
[{"$nulls":4},0,0,0]
[{"$nulls":4},0,0,0]
[{"$nulls":4},0,0,0]
[{"$nulls":4},0,0,0]
[{"$nulls":4},0,0,0]
[{"$nulls":4},0,0,0]
[{"$nulls":4},0,0,0]
[{"$nulls":4},0,0,0]
[{"$nulls":4},0,0,0]
[{"$nulls":4},0,0,0]
[{"$nulls":4},0,0,0]
[{"$nulls":4},0,0,0]
[{"$nulls":4},0,0,0]
[{"$nulls":4},0,0,0]
[{"$nulls":4},0,0,0]
[{"$nulls":4},0,0,0]
[{"$nulls":4},0,0,0]
[{"$nulls":4},0,0,0]
[{"$nulls":4},0,0,0]
[{"$nulls":4},0,0,0]
[{"$nulls":4},0,0,0]
[{"$nulls":4},0,0,0]
[{"$nulls":4},0,0,0]
[{"$nulls":4},0,0,0]
[{"$nulls":4},0,0,0]
[{"$nulls":4},0,0,0]
[{"$nulls":4},0,0,0]
[{"$nulls":4},0,0,0]
[{"$nulls":4},0,0,0]
[{"$nulls":4},0,0,0]
[{"$nulls":4},0,0,0]
[{"$nulls":4},0,0,0]
[{"$nulls":4},0,0,0]
[{"$nulls":4},0,0,0]
[{"$nulls":4},0,0,0]
[{"$nulls":4},0,0,0]
[{"$nulls":4},0,0,0]
[{"$nulls":4},0,0,0]
[{"$nulls":4},0,0,0]
[{"$nulls":4},0,0,0]
[{"$nulls":4},0,0,0]
[{"$nulls":4},0,0,0]
[{"$nulls":4},0,0,0]
[{"$nulls":4},0,0,0]
[{"$nulls":4},0,0,0]
[{"$nulls":4},0,0,0]
[{"$nulls":4},0,0,0]
[{"$nulls":4},0,0,0]
[{"$nulls":4},0,0,0]
[{"$nulls":4},0,0,0]
[{"$nulls":4},0,0,0]
[{"$nulls":4},0,0,0]
[{"$nulls":4},0,0,0]
[{"$nulls":4},0,0,0]
[{"$nulls":4},0,0,0]
[{"$nulls":4},0,0,0]
[{"$nulls":4},0,0,0]
[{"$nulls":4},0,0,0]
[{"$nulls":4},0,0,0]
[{"$nulls":4},0,0,0]
[{"$nulls":4},0,0,0]
[{"$nulls":4},0,0,0]
[{"$nulls":4},0,0,0]
[{"$nulls":4},0,0,0]
[{"$nulls":4},0,0,0]
[{"$nulls":4},0,0,0]
[{"$nulls":4},0,0,0]
[{"$nulls":4},0,0,0]
[{"$nulls":4},0,0,0]
[{"$nulls":4},0,0,0]
[{"$nulls":4},0,0,0]
[{"$nulls":4},0,0,0]
[{"$nulls":4},0,0,0]
[{"$nulls":4},0,0,0]
[{"$nulls":4},0,0,0]
[{"$nulls":4},0,0,0]
[{"$nulls":4},0,0,0]
[{"$nulls":4},0,0,0]
[{"$nulls":4},0,0,0]
[{"$nulls":4},0,0,0]
[{"$nulls":4},0,0,0]
[{"$nulls":4},0,0,0]
[{"$nulls":4},0,0,0]
[{"$nulls":4},0,0,0]
[{"$nulls":4},0,0,0]
[{"$nulls":4},0,0,0]
[{"$nulls":4},0,0,0]
[{"$nulls":4},0,0,0]
[{"$nulls":4},0,0,0]
[{"$nulls":4},0,0,0]
[{"$nulls":4},0,0,0]
[{"$nulls":4},0,0,0]
[{"$nulls":4},0,0,0]
[{"$nulls":4},0,0,0]
[{"$nulls":4},0,0,0]
[{"$nulls":4},0,0,0]
[{"$nulls":4},0,0,0]
[{"$nulls":4},0,0,0]
[{"$nulls":4},0,0,0]
[{"$nulls":4},0,0,0]
[{"$nulls":4},0,0,0]
[{"$nulls":4},0,0,0]
[{"$nulls":4},0,0,0]
[{"$nulls":4},0,0,0]
[{"$nulls":4},0,0,0]
[{"$nulls":4},0,0,0]
[{"$nulls":4},0,0,0]
[{"$nulls":4},0,0,0]
[{"$nulls":4},0,0,0]
[{"$nulls":4},0,0,0]
[{"$nulls":4},0,0,0]
[{"$nulls":4},0,0,0]
[{"$nulls":4},0,0,0]
[{"$nulls":4},0,0,0]
[{"$nulls":4},0,0,0]
[{"$nulls":4},0,0,0]
[{"$nulls":4},0,0,0]
[{"$nulls":4},0,0,0]
[{"$nulls":4},0,0,0]
[{"$nulls":4},0,0,0]
[{"$nulls":4},0,0,0]
[{"$nulls":4},0,0,0]
[{"$nulls":4},0,0,0]
[{"$nulls":4},0,0,0]
[{"$nulls":4},0,0,0]
[{"$nulls":4},0,0,0]
[{"$nulls":4},0,0,0]
[{"$nulls":4},0,0,0]
[{"$nulls":4},0,0,0]
[{"$nulls":4},0,0,0]
[{"$nulls":4},0,0,0]
[{"$nulls":4},0,0,0]
[{"$nulls":4},0,0,0]
[{"$nulls":4},0,0,0]
[{"$nulls":4},0,0,0]
[{"$nulls":4},0,0,0]
[{"$nulls":4},0,0,0]
[{"$nulls":4},0,0,0]
[{"$nulls":4},0,0,0]
[{"$nulls":4},0,0,0]
[{"$nulls":4},0,0,0]
[{"$nulls":4},0,0,0]
[{"$nulls":4},0,0,0]
[{"$nulls":4},0,0,0]
[{"$nulls":4},0,0,0]
[{"$nulls":4},0,0,0]
[{"$nulls":4},0,0,0]
[{"$nulls":4},0,0,0]
[{"$nulls":4},0,0,0]
[{"$nulls":4},0,0,0]
[{"$nulls":4},0,0,0]
[{"$nulls":4},0,0,0]
[{"$nulls":4},0,0,0]
[{"$nulls":4},0,0,0]
[{"$nulls":4},0,0,0]
[{"$nulls":4},0,0,0]
[{"$nulls":4},0,0,0]
[{"$nulls":4},0,0,0]
[{"$nulls":4},0,0,0]
[{"$nulls":4},0,0,0]
[{"$nulls":4},0,0,0]
[{"$nulls":4},0,0,0]
[{"$nulls":4},0,0,0]
[{"$nulls":4},0,0,0]
[{"$nulls":4},0,0,0]
[{"$nulls":4},0,0,0]
[{"$nulls":4},0,0,0]
[{"$nulls":4},0,0,0]
[{"$nulls":4},0,0,0]
[{"$nulls":4},0,0,0]
[{"$nulls":4},0,0,0]
[{"$nulls":4},0,0,0]
[{"$nulls":4},0,0,0]
[{"$nulls":4},0,0,0]
[{"$nulls":4},0,0,0]
[{"$nulls":4},0,0,0]
[{"$nulls":4},0,0,0]
[{"$nulls":4},0,0,0]
[{"$nulls":4},0,0,0]
[{"$nulls":4},0,0,0]
[{"$nulls":4},0,0,0]
[{"$nulls":4},0,0,0]
[{"$nulls":4},0,0,0]
[{"$nulls":4},0,0,0]
[{"$nulls":4},0,0,0]
[{"$nulls":4},0,0,0]
[{"$nulls":4},0,0,0]
[{"$nulls":4},0,0,0]
[{"$nulls":4},0,0,0]
[{"$nulls":4},0,0,0]
[{"$nulls":4},0,0,0]
[{"$nulls":4},0,0,0]
[{"$nulls":4},0,0,0]
[{"$nulls":4},0,0,0]
[{"$nulls":4},0,0,0]
[{"$nulls":4},0,0,0]
[{"$nulls":4},0,0,0]
[{"$nulls":4},0,0,0]
[{"$nulls":4},0,0,0]
[{"$nulls":4},0,0,0]
[{"$nulls":4},0,0,0]
[{"$nulls":4},0,0,0]
[{"$nulls":4},0,0,0]
[{"$nulls":4},0,0,0]
[{"$nulls":4},0,0,0]
[{"$nulls":4},0,0,0]
[{"$nulls":4},0,0,0]
[{"$nulls":4},0,0,0]
[{"$nulls":4},0,0,0]
[{"$nulls":4},0,0,0]
[{"$nulls":4},0,0,0]
[{"$nulls":4},0,0,0]
[{"$nulls":4},0,0,0]
[{"$nulls":4},0,0,0]
[{"$nulls":4},0,0,0]
[{"$nulls":4},0,0,0]
[{"$nulls":4},0,0,0]
[{"$nulls":4},0,0,0]
[{"$nulls":4},0,0,0]
[{"$nulls":4},0,0,0]
[{"$nulls":4},0,0,0]
[{"$nulls":4},0,0,0]
[{"$nulls":4},0,0,0]
[{"$nulls":4},0,0,0]
[{"$nulls":4},0,0,0]
[{"$nulls":4},0,0,0]
[{"$nulls":4},0,0,0]
[{"$nulls":4},0,0,0]
[{"$nulls":4},0,0,0]
[{"$nulls":4},0,0,0]
[{"$nulls":4},0,0,0]
[{"$nulls":4},0,0,0]
[{"$nulls":4},0,0,0]
[{"$nulls":4},0,0,0]
[{"$nulls":4},0,0,0]
[{"$nulls":4},0,0,0]
[{"$nulls":4},0,0,0]
[{"$nulls":4},0,0,0]
[{"$nulls":4},0,0,0]
[{"$nulls":4},0,0,0]
[{"$nulls":4},0,0,0]
[{"$nulls":4},0,0,0]
[{"$nulls":4},0,0,0]
[{"$nulls":4},0,0,0]
[{"$nulls":4},0,0,0]
[{"$nulls":4},0,0,0]
[{"$nulls":4},0,0,0]
[{"$nulls":4},0,0,0]
[{"$nulls":4},0,0,0]
[{"$nulls":4},0,0,0]
[{"$nulls":4},0,0,0]
[{"$nulls":4},0,0,0]
[{"$nulls":4},0,0,0]
[{"$nulls":4},0,0,0]
[{"$nulls":4},0,0,0]
[{"$nulls":4},0,0,0]
[{"$nulls":4},0,0,0]
[{"$nulls":4},0,0,0]
[{"$nulls":4},0,0,0]
[{"$nulls":4},0,0,0]
[{"$nulls":4},0,0,0]
[{"$nulls":4},0,0,0]
[{"$nulls":4},0,0,0]
[{"$nulls":4},0,0,0]
[{"$nulls":4},0,0,0]
[{"$nulls":4},0,0,0]
[{"$nulls":4},0,0,0]
[{"$nulls":4},0,0,0]
[{"$nulls":4},0,0,0]
[{"$nulls":4},0,0,0]
[{"$nulls":4},0,0,0]
[{"$nulls":4},0,0,0]
[{"$nulls":4},0,0,0]
[{"$nulls":4},0,0,0]
[{"$nulls":4},0,0,0]
[{"$nulls":4},0,0,0]
[{"$nulls":4},0,0,0]
[{"$nulls":4},0,0,0]
[{"$nulls":4},0,0,0]
[{"$nulls":4},0,0,0]
[{"$nulls":4},0,0,0]
[{"$nulls":4},0,0,0]
[{"$nulls":4},0,0,0]
[{"$nulls":4},0,0,0]
[{"$nulls":4},0,0,0]
[{"$nulls":4},0,0,0]
[{"$nulls":4},0,0,0]
[{"$nulls":4},0,0,0]
[{"$nulls":4},0,0,0]
[{"$nulls":4},0,0,0]
[{"$nulls":4},0,0,0]
[{"$nulls":4},0,0,0]
[{"$nulls":4},0,0,0]
[{"$nulls":4},0,0,0]
[{"$nulls":4},0,0,0]
[{"$nulls":4},0,0,0]
[{"$nulls":4},0,0,0]
[{"$nulls":4},0,0,0]
[{"$nulls":4},0,0,0]
[{"$nulls":4},0,0,0]
[{"$nulls":4},0,0,0]
[{"$nulls":4},0,0,0]
[{"$nulls":4},0,0,0]
[{"$nulls":4},0,0,0]
[{"$nulls":4},0,0,0]
[{"$nulls":4},0,0,0]
[{"$nulls":4},0,0,0]
[{"$nulls":4},0,0,0]
[{"$nulls":4},0,0,0]
[{"$nulls":4},0,0,0]
[{"$nulls":4},0,0,0]
[{"$nulls":4},0,0,0]
[{"$nulls":4},0,0,0]
[{"$nulls":4},0,0,0]
[{"$nulls":4},0,0,0]
[{"$nulls":4},0,0,0]
[{"$nulls":4},0,0,0]
[{"$nulls":4},0,0,0]
[{"$nulls":4},0,0,0]
[{"$nulls":4},0,0,0]
[{"$nulls":4},0,0,0]
[{"$nulls":4},0,0,0]
[{"$nulls":4},0,0,0]
[{"$nulls":4},0,0,0]
[{"$nulls":4},0,0,0]
[{"$nulls":4},0,0,0]
[{"$nulls":4},0,0,0]
[{"$nulls":4},0,0,0]
[{"$nulls":4},0,0,0]
[{"$nulls":4},0,0,0]
[{"$nulls":4},0,0,0]
[{"$nulls":4},0,0,0]
[{"$nulls":4},0,0,0]
[{"$nulls":4},0,0,0]
[{"$nulls":4},0,0,0]
[{"$nulls":4},0,0,0]
[{"$nulls":4},0,0,0]
[{"$nulls":4},0,0,0]
[{"$nulls":4},0,0,0]
[{"$nulls":4},0,0,0]
[{"$nulls":4},0,0,0]
[{"$nulls":4},0,0,0]
[{"$nulls":4},0,0,0]
[{"$nulls":4},0,0,0]
[{"$nulls":4},0,0,0]
[{"$nulls":4},0,0,0]
[{"$nulls":4},0,0,0]
[{"$nulls":4},0,0,0]
[{"$nulls":4},0,0,0]
[{"$nulls":4},0,0,0]
[{"$nulls":4},0,0,0]
[{"$nulls":4},0,0,0]
[{"$nulls":4},0,0,0]
[{"$nulls":4},0,0,0]
[{"$nulls":4},0,0,0]
[{"$nulls":4},0,0,0]
[{"$nulls":4},0,0,0]
[{"$nulls":4},0,0,0]
[{"$nulls":4},0,0,0]
[{"$nulls":4},0,0,0]
[{"$nulls":4},0,0,0]
[{"$nulls":4},0,0,0]
[{"$nulls":4},0,0,0]
[{"$nulls":4},0,0,0]
[{"$nulls":4},0,0,0]
[{"$nulls":4},0,0,0]
[{"$nulls":4},0,0,0]
[{"$nulls":4},0,0,0]
[{"$nulls":4},0,0,0]
[{"$nulls":4},0,0,0]
[{"$nulls":4},0,0,0]
[{"$nulls":4},0,0,0]
[{"$nulls":4},0,0,0]
[{"$nulls":4},0,0,0]
[{"$nulls":4},0,0,0]
[{"$nulls":4},0,0,0]
[{"$nulls":4},0,0,0]
[{"$nulls":4},0,0,0]
[{"$nulls":4},0,0,0]
[{"$nulls":4},0,0,0]
[{"$nulls":4},0,0,0]
[{"$nulls":4},0,0,0]
[{"$nulls":4},0,0,0]
[{"$nulls":4},0,0,0]
[{"$nulls":4},0,0,0]
[{"$nulls":4},0,0,0]
[{"$nulls":4},0,0,0]
[{"$nulls":4},0,0,0]
[{"$nulls":4},0,0,0]
[{"$nulls":4},0,0,0]
[{"$nulls":4},0,0,0]
[{"$nulls":4},0,0,0]
[{"$nulls":4},0,0,0]
[{"$nulls":4},0,0,0]
[{"$nulls":4},0,0,0]
[{"$nulls":4},0,0,0]
[{"$nulls":4},0,0,0]
[{"$nulls":4},0,0,0]
[{"$nulls":4},0,0,0]
[{"$nulls":4},0,0,0]
[{"$nulls":4},0,0,0]
[{"$nulls":4},0,0,0]
[{"$nulls":4},0,0,0]
[{"$nulls":4},0,0,0]
[{"$nulls":4},0,0,0]
[{"$nulls":4},0,0,0]
[{"$nulls":4},0,0,0]
[{"$nulls":4},0,0,0]
[{"$nulls":4},0,0,0]
[{"$nulls":4},0,0,0]
[{"$nulls":4},0,0,0]
[{"$nulls":4},0,0,0]
[{"$nulls":4},0,0,0]
[{"$nulls":4},0,0,0]
[{"$nulls":4},0,0,0]
[{"$nulls":4},0,0,0]
[{"$nulls":4},0,0,0]
[{"$nulls":4},0,0,0]
[{"$nulls":4},0,0,0]
[{"$nulls":4},0,0,0]
[{"$nulls":4},0,0,0]
[{"$nulls":4},0,0,0]
[{"$nulls":4},0,0,0]
[{"$nulls":4},0,0,0]
[{"$nulls":4},0,0,0]
[{"$nulls":4},0,0,0]
[{"$nulls":4},0,0,0]
[{"$nulls":4},0,0,0]
[{"$nulls":4},0,0,0]
[{"$nulls":4},0,0,0]
[{"$nulls":4},0,0,0]
[{"$nulls":4},0,0,0]
[{"$nulls":4},0,0,0]
[{"$nulls":4},0,0,0]
[{"$nulls":4},0,0,0]
[{"$nulls":4},0,0,0]
[{"$nulls":4},0,0,0]
[{"$nulls":4},0,0,0]
[{"$nulls":4},0,0,0]
[{"$nulls":4},0,0,0]
[{"$nulls":4},0,0,0]
[{"$nulls":4},0,0,0]
[{"$nulls":4},0,0,0]
[{"$nulls":4},0,0,0]
[{"$nulls":4},0,0,0]
[{"$nulls":4},0,0,0]
[{"$nulls":4},0,0,0]
[{"$nulls":4},0,0,0]
[{"$nulls":4},0,0,0]
[{"$nulls":4},0,0,0]
[{"$nulls":4},0,0,0]
[{"$nulls":4},0,0,0]
[{"$nulls":4},0,0,0]
[{"$nulls":4},0,0,0]
[{"$nulls":4},0,0,0]
[{"$nulls":4},0,0,0]
[{"$nulls":4},0,0,0]
[{"$nulls":4},0,0,0]
[{"$nulls":4},0,0,0]
[{"$nulls":4},0,0,0]
[{"$nulls":4},0,0,0]
[{"$nulls":4},0,0,0]
[{"$nulls":4},0,0,0]
[{"$nulls":4},0,0,0]
[{"$nulls":4},0,0,0]
[{"$nulls":4},0,0,0]
[{"$nulls":4},0,0,0]
[{"$nulls":4},0,0,0]
[{"$nulls":4},0,0,0]
[{"$nulls":4},0,0,0]
[{"$nulls":4},0,0,0]
[{"$nulls":4},0,0,0]
[{"$nulls":4},0,0,0]
[{"$nulls":4},0,0,0]
[{"$nulls":4},0,0,0]
[{"$nulls":4},0,0,0]
[{"$nulls":4},0,0,0]
[{"$nulls":4},0,0,0]
[{"$nulls":4},0,0,0]
[{"$nulls":4},0,0,0]
[{"$nulls":4},0,0,0]
[{"$nulls":4},0,0,0]
[{"$nulls":4},0,0,0]
[{"$nulls":4},0,0,0]
[{"$nulls":4},0,0,0]
[{"$nulls":4},0,0,0]
[{"$nulls":4},0,0,0]
[{"$nulls":4},0,0,0]
[{"$nulls":4},0,0,0]
[{"$nulls":4},0,0,0]
[{"$nulls":4},0,0,0]
[{"$nulls":4},0,0,0]
[{"$nulls":4},0,0,0]
[{"$nulls":4},0,0,0]
[{"$nulls":4},0,0,0]
[{"$nulls":4},0,0,0]
[{"$nulls":4},0,0,0]
[{"$nulls":4},0,0,0]
[{"$nulls":4},0,0,0]
[{"$nulls":4},0,0,0]
[{"$nulls":4},0,0,0]
[{"$nulls":4},0,0,0]
[{"$nulls":4},0,0,0]
[{"$nulls":4},0,0,0]
[{"$nulls":4},0,0,0]
[{"$nulls":4},0,0,0]
[{"$nulls":4},0,0,0]
[{"$nulls":4},0,0,0]
[{"$nulls":4},0,0,0]
[{"$nulls":4},0,0,0]
[{"$nulls":4},0,0,0]
[{"$nulls":4},0,0,0]
[{"$nulls":4},0,0,0]
[{"$nulls":4},0,0,0]
[{"$nulls":4},0,0,0]
[{"$nulls":4},0,0,0]
[{"$nulls":4},0,0,0]
[{"$nulls":4},0,0,0]
[{"$nulls":4},0,0,0]
[{"$nulls":4},0,0,0]
[{"$nulls":4},0,0,0]
[{"$nulls":4},0,0,0]
[{"$nulls":4},0,0,0]
[{"$nulls":4},0,0,0]
[{"$nulls":4},0,0,0]
[{"$nulls":4},0,0,0]
[{"$nulls":4},0,0,0]
[{"$nulls":4},0,0,0]
[{"$nulls":4},0,0,0]
[{"$nulls":4},0,0,0]
[{"$nulls":4},0,0,0]
[{"$nulls":4},0,0,0]
[{"$nulls":4},0,0,0]
[{"$nulls":4},0,0,0]
[{"$nulls":4},0,0,0]
[{"$nulls":4},0,0,0]
[{"$nulls":4},0,0,0]
[{"$nulls":4},0,0,0]
[{"$nulls":4},0,0,0]
[{"$nulls":4},0,0,0]
[{"$nulls":4},0,0,0]
[{"$nulls":4},0,0,0]
[{"$nulls":4},0,0,0]
[{"$nulls":4},0,0,0]
[{"$nulls":4},0,0,0]
[{"$nulls":4},0,0,0]
[{"$nulls":4},0,0,0]
[{"$nulls":4},0,0,0]
[{"$nulls":4},0,0,0]
[{"$nulls":4},0,0,0]
[{"$nulls":4},0,0,0]
[{"$nulls":4},0,0,0]
[{"$nulls":4},0,0,0]
[{"$nulls":4},0,0,0]
[{"$nulls":4},0,0,0]
[{"$nulls":4},0,0,0]
[{"$nulls":4},0,0,0]
[{"$nulls":4},0,0,0]
[{"$nulls":4},0,0,0]
[{"$nulls":4},0,0,0]
[{"$nulls":4},0,0,0]
[{"$nulls":4},0,0,0]
[{"$nulls":4},0,0,0]
[{"$nulls":4},0,0,0]
[{"$nulls":4},0,0,0]
[{"$nulls":4},0,0,0]
[{"$nulls":4},0,0,0]
[{"$nulls":4},0,0,0]
[{"$nulls":4},0,0,0]
[{"$nulls":4},0,0,0]
[{"$nulls":4},0,0,0]
[{"$nulls":4},0,0,0]
[{"$nulls":4},0,0,0]
[{"$nulls":4},0,0,0]
[{"$nulls":4},0,0,0]
[{"$nulls":4},0,0,0]
[{"$nulls":4},0,0,0]
[{"$nulls":4},0,0,0]
[{"$nulls":4},0,0,0]
[{"$nulls":4},0,0,0]
[{"$nulls":4},0,0,0]
[{"$nulls":4},0,0,0]
[{"$nulls":4},0,0,0]
[{"$nulls":4},0,0,0]
[{"$nulls":4},0,0,0]
[{"$nulls":4},0,0,0]
[{"$nulls":4},0,0,0]
[{"$nulls":4},0,0,0]
[{"$nulls":4},0,0,0]
[{"$nulls":4},0,0,0]
[{"$nulls":4},0,0,0]
[{"$nulls":4},0,0,0]
[{"$nulls":4},0,0,0]
[{"$nulls":4},0,0,0]
[{"$nulls":4},0,0,0]
[{"$nulls":4},0,0,0]
[{"$nulls":4},0,0,0]
[{"$nulls":4},0,0,0]
[{"$nulls":4},0,0,0]
[{"$nulls":4},0,0,0]
[{"$nulls":4},0,0,0]
[{"$nulls":4},0,0,0]
[{"$nulls":4},0,0,0]
[{"$nulls":4},0,0,0]
[{"$nulls":4},0,0,0]
[{"$nulls":4},0,0,0]
[{"$nulls":4},0,0,0]
[{"$nulls":4},0,0,0]
[{"$nulls":4},0,0,0]
[{"$nulls":4},0,0,0]
[{"$nulls":4},0,0,0]
[{"$nulls":4},0,0,0]
[{"$nulls":4},0,0,0]
[{"$nulls":4},0,0,0]
[{"$nulls":4},0,0,0]
[{"$nulls":4},0,0,0]
[{"$nulls":4},0,0,0]
[{"$nulls":4},0,0,0]
[{"$nulls":4},0,0,0]
[{"$nulls":4},0,0,0]
[{"$nulls":4},0,0,0]
[{"$nulls":4},0,0,0]
[{"$nulls":4},0,0,0]
[{"$nulls":4},0,0,0]
[{"$nulls":4},0,0,0]
[{"$nulls":4},0,0,0]
[{"$nulls":4},0,0,0]
[{"$nulls":4},0,0,0]
[{"$nulls":4},0,0,0]
[{"$nulls":4},0,0,0]
[{"$nulls":4},0,0,0]
[{"$nulls":4},0,0,0]
[{"$nulls":4},0,0,0]
[{"$nulls":4},0,0,0]
[{"$nulls":4},0,0,0]
[{"$nulls":4},0,0,0]
[{"$nulls":4},0,0,0]
[{"$nulls":4},0,0,0]
[{"$nulls":4},0,0,0]
[{"$nulls":4},0,0,0]
[{"$nulls":4},0,0,0]
[{"$nulls":4},0,0,0]
[{"$nulls":4},0,0,0]
[{"$nulls":4},0,0,0]
[{"$nulls":4},0,0,0]
[{"$nulls":4},0,0,0]
[{"$nulls":4},0,0,0]
[{"$nulls":4},0,0,0]
[{"$nulls":4},0,0,0]
[{"$nulls":4},0,0,0]
[{"$nulls":4},0,0,0]
[{"$nulls":4},0,0,0]
[{"$nulls":4},0,0,0]
[{"$nulls":4},0,0,0]
[{"$nulls":4},0,0,0]
[{"$nulls":4},0,0,0]
[{"$nulls":4},0,0,0]
[{"$nulls":4},0,0,0]
[{"$nulls":4},0,0,0]
[{"$nulls":4},0,0,0]
[{"$nulls":4},0,0,0]
[{"$nulls":4},0,0,0]
[{"$nulls":4},0,0,0]
[{"$nulls":4},0,0,0]
[{"$nulls":4},0,0,0]
[{"$nulls":4},0,0,0]
[{"$nulls":4},0,0,0]
[{"$nulls":4},0,0,0]
[{"$nulls":4},0,0,0]
[{"$nulls":4},0,0,0]
[{"$nulls":4},0,0,0]
[{"$nulls":4},0,0,0]
[{"$nulls":4},0,0,0]
[{"$nulls":4},0,0,0]
[{"$nulls":4},0,0,0]
[{"$nulls":4},0,0,0]
[{"$nulls":4},0,0,0]
[{"$nulls":4},0,0,0]
[{"$nulls":4},0,0,0]
[{"$nulls":4},0,0,0]
[{"$nulls":4},0,0,0]
[{"$nulls":4},0,0,0]
[{"$nulls":4},0,0,0]
[{"$nulls":4},0,0,0]
[{"$nulls":4},0,0,0]
[{"$nulls":4},0,0,0]
[{"$nulls":4},0,0,0]
[{"$nulls":4},0,0,0]
[{"$nulls":4},0,0,0]
[{"$nulls":4},0,0,0]
[{"$nulls":4},0,0,0]
[{"$nulls":4},0,0,0]
[{"$nulls":4},0,0,0]
[{"$nulls":4},0,0,0]
[{"$nulls":4},0,0,0]
[{"$nulls":4},0,0,0]
[{"$nulls":4},0,0,0]
[{"$nulls":4},0,0,0]
[{"$nulls":4},0,0,0]
[{"$nulls":4},0,0,0]
[{"$nulls":4},0,0,0]
[{"$nulls":4},0,0,0]
[{"$nulls":4},0,0,0]
[{"$nulls":4},0,0,0]
[{"$nulls":4},0,0,0]
[{"$nulls":4},0,0,0]
[{"$nulls":4},0,0,0]
[{"$nulls":4},0,0,0]
[{"$nulls":4},0,0,0]
[{"$nulls":4},0,0,0]
[{"$nulls":4},0,0,0]
[{"$nulls":4},0,0,0]
[{"$nulls":4},0,0,0]
[{"$nulls":4},0,0,0]
[{"$nulls":4},0,0,0]
[{"$nulls":4},0,0,0]
[{"$nulls":4},0,0,0]
[{"$nulls":4},0,0,0]
[{"$nulls":4},0,0,0]
[{"$nulls":4},0,0,0]
[{"$nulls":4},0,0,0]
[{"$nulls":4},0,0,0]
[{"$nulls":4},0,0,0]
[{"$nulls":4},0,0,0]
[{"$nulls":4},0,0,0]
[{"$nulls":4},0,0,0]
[{"$nulls":4},0,0,0]
[{"$nulls":4},0,0,0]
[{"$nulls":4},0,0,0]
[{"$nulls":4},0,0,0]
[{"$nulls":4},0,0,0]
[{"$nulls":4},0,0,0]
[{"$nulls":4},0,0,0]
[{"$nulls":4},0,0,0]
[{"$nulls":4},0,0,0]
[{"$nulls":4},0,0,0]
[{"$nulls":4},0,0,0]
[{"$nulls":4},0,0,0]
[{"$nulls":4},0,0,0]
[{"$nulls":4},0,0,0]
[{"$nulls":4},0,0,0]
[{"$nulls":4},0,0,0]
[{"$nulls":4},0,0,0]
[{"$nulls":4},0,0,0]
[{"$nulls":4},0,0,0]
[{"$nulls":4},0,0,0]
[{"$nulls":4},0,0,0]
[{"$nulls":4},0,0,0]
[{"$nulls":4},0,0,0]
[{"$nulls":4},0,0,0]
[{"$nulls":4},0,0,0]
[{"$nulls":4},0,0,0]
[{"$nulls":4},0,0,0]
[{"$nulls":4},0,0,0]
[{"$nulls":4},0,0,0]
[{"$nulls":4},0,0,0]
[{"$nulls":4},0,0,0]
[{"$nulls":4},0,0,0]
[{"$nulls":4},0,0,0]
[{"$nulls":4},0,0,0]
[{"$nulls":4},0,0,0]
[{"$nulls":4},0,0,0]
[{"$nulls":4},0,0,0]
[{"$nulls":4},0,0,0]
[{"$nulls":4},0,0,0]
[{"$nulls":4},0,0,0]
[{"$nulls":4},0,0,0]
[{"$nulls":4},0,0,0]
[{"$nulls":4},0,0,0]
[{"$nulls":4},0,0,0]
[{"$nulls":4},0,0,0]
[{"$nulls":4},0,0,0]
[{"$nulls":4},0,0,0]
[{"$nulls":4},0,0,0]
[{"$nulls":4},0,0,0]
[{"$nulls":4},0,0,0]
[{"$nulls":4},0,0,0]
[{"$nulls":4},0,0,0]
[{"$nulls":4},0,0,0]
[{"$nulls":4},0,0,0]
[{"$nulls":4},0,0,0]
[{"$nulls":4},0,0,0]
[{"$nulls":4},0,0,0]
[{"$nulls":4},0,0,0]
[{"$nulls":4},0,0,0]
[{"$nulls":4},0,0,0]
[{"$nulls":4},0,0,0]
[{"$nulls":4},0,0,0]
[{"$nulls":4},0,0,0]
[{"$nulls":4},0,0,0]
[{"$nulls":4},0,0,0]
[{"$nulls":4},0,0,0]
[{"$nulls":4},0,0,0]
[{"$nulls":4},0,0,0]
[{"$nulls":4},0,0,0]
[{"$nulls":4},0,0,0]
[{"$nulls":4},0,0,0]
[{"$nulls":4},0,0,0]
[{"$nulls":4},0,0,0]
[{"$nulls":4},0,0,0]
[{"$nulls":4},0,0,0]
[{"$nulls":4},0,0,0]
[{"$nulls":4},0,0,0]
[{"$nulls":4},0,0,0]
[{"$nulls":4},0,0,0]
[{"$nulls":4},0,0,0]

{"sheet":"prospetto 2","index":3,"n_rows":89,"n_cols":9,"rows_kept":89,"merged":[[7,1,7,6],[8,1,8,6],[11,1,11,6],[13,0,13,6],[15,1,15,6],[16,0,16,4],[17,1,17,6],[18,1,18,6],[28,2,28,5],[29,2,29,5],[33,0,33,2],[34,0,34,4],[35,0,35,4],[61,0,61,8],[63,0,63,4],[66,0,66,2],[74,1,74,2],[82,0,82,2],[85,0,85,3],[86,3,86,4],[86,7,86,8],[91,0,91,3],[92,3,92,4],[92,7,92,8]]}
[{"$nulls":8},"Prospetto 2"]
["Impresa ",null,{"$f":"'Foglio Informativo'!C4","v":" << Fare click per selezionare la compagnia >> "},{"$nulls":5},{"$f":"'Foglio Informativo'!J4","v":"   "}]
[null,null,"(denominazione)",{"$nulls":5},"(codice)"]
[null,null,"RAMI VITA - Esercizio  ",null,{"$f":"'Foglio Informativo'!D6","v":"2019"}]
["Sez. A",{"$nulls":7},"(Valori in migliaia di Euro)"]
[]
["Margine di solvibilità disponibile (Prospetto margine voce 169)",{"$nulls":6},1]
["di cui: ","- Totale azioni preferenziali cumulative e passività subordinate (Prospetto margine voce 87)",{"$nulls":5},{"$f":"H7+1","v":2}]
[null,"- Totale elementi B (Prospetto margine voce 102)",{"$nulls":5},35]
["Margine di solvibilità richiesto (Prospetto margine voce 168)",{"$nulls":6},3]
["Patrimonio netto (Stato Patrimoniale voce 110) (*)",{"$nulls":6},{"$f":"H10+1","v":4},0]
["di cui:","Capitale sociale sottoscritto o fondo equivalente (Stato Patrimoniale voce 101) (*)",{"$nulls":5},{"$f":"H11+1","v":5},0]
[null,"Riserve patrimoniali (Stato Patrimoniale voci da 102 a 107) (*)",{"$nulls":5},{"$f":"H12+1","v":6},0]
["Indebitamento finanziario (Stato Patrimoniale voci 111+141+142+143+144) (*)",{"$nulls":6},36,0]
["Riserve tecniche (Stato Patrimoniale voce 123) (*)",{"$nulls":6},10,0]
["di cui: ","Riserve matematiche  (Stato Patrimoniale voce 118)",{"$nulls":5},37,0]
["Riserve tecniche allorchè il rischio dell'investimento è sopportato dagli assicurati e riserve derivanti dalla gestione dei fondi pensione (Stato Patrimoniale voce 127) (*)",{"$nulls":6},11,{"$f":"SUM(I18:I19)","v":0}]
["di cui:","Riserve relative a contratti le cui prestazioni sono connesse con fondi di investimento e indici di mercato (Stato Patrimoniale voce 125) (*)",{"$nulls":5},{"$f":"H17+1","v":12},0]
[null,"Riserve derivanti dalla gestione di fondi pensione (Stato Patrimoniale voce 126) (*)",{"$nulls":5},{"$f":"H18+1","v":13},0]
["Totale attivo (Stato Patrimoniale voce 100)",{"$nulls":6},38,0]
["Investimenti (Stato Patrimoniale voce 54)  (*)",{"$nulls":5},"A  ",14,0]
["di cui (**):",null,"Terreni e fabbricati",{"$nulls":4},{"$f":"H21+1","v":15},0]
[null,null,"Azioni e quote di imprese ",{"$nulls":4},{"$f":"H22+1","v":16},0]
[null,null,"di cui : non destinate a permanere durevolmente nel patrimonio dell'impresa",{"$nulls":4},39,0]
[null,null,"di cui: Azioni e quote di imprese del gruppo e altre partecipate",{"$nulls":4},40,0]
[null,null,"Obbligazioni e altri titoli a reddito fisso",{"$nulls":4},17,0]
[null,null,"di cui : non destinate a permanere durevolmente nel patrimonio dell'impresa",{"$nulls":4},41,0]
[null,null,"di cui: Titoli di debito emessi o garantiti da Stati dell'Unione Europea compresi nella classe C.III.3",{"$nulls":4},79]
[null,null,"           di cui: Titoli di debito emessi o garantiti da Stati dell'Unione Europea compresi nella\n           classe C.III.3 non destinati a permanere durevolmente nel patrimonio dell'impresa",{"$nulls":4},80]
[null,null,"           di cui: Titoli di debito emessi o garantiti da Stati dell'Unione Europea compresi nella\n           classe C.III.3 destinati a permanere durevolmente nel patrimonio dell'impresa",{"$nulls":4},81]
[null,null,"di cui: Obbligazioni emesse da imprese del gruppo e altre partecipate",{"$nulls":4},{"$f":"H27+1","v":42},0]
[null,null,"Quote di fondi comuni di investimento",{"$nulls":4},18,0]
[null,null,"di cui : non destinate a permanere durevolmente nel patrimonio dell'impresa",{"$nulls":4},{"$f":"H31+1","v":43},0]
["Disponibilità liquide (voce 90)",{"$nulls":6},{"$f":"H33+1","v":44},0]
["Investimenti relativi a prestazioni connesse con fondi di investimento e indici di mercato (Stato Patrimoniale voce 55) (*)                 ",{"$nulls":5},"B  ",19,0]
["Investimenti derivanti dalla gestione dei fondi pensione (Stato Patrimoniale voce 56) (*)         ",{"$nulls":5},"C   ",{"$f":"H35+1","v":20},0]
["Totale investimenti",{"$nulls":5},"(A + B + C)  ",{"$f":"H36+1","v":21},{"$f":"I21+I35+I36","v":0}]
["Riserve tecniche a carico dei riassicuratori (Stato Patrimoniale voce 69) (*)",{"$nulls":6},45,0]
["Premi lordi contabilizzati (Conto economico voce 30)",{"$nulls":6},22,{"$f":"I40+I43","v":0}]
["di cui:","portafoglio italiano:",{"$nulls":5},{"$f":"H39+1","v":23},{"$f":"I41+I42","v":0}]
[null,null,"lavoro diretto ",{"$nulls":4},24,0]
[null,null,"lavoro indiretto ",{"$nulls":4},25,0]
[null,"portafoglio estero:",{"$nulls":5},26,{"$f":"I44+I45","v":0}]
[null,null,"lavoro diretto ",{"$nulls":4},27,0]
[null,null,"lavoro indiretto ",{"$nulls":4},28,0]
["Premi ceduti in riassicurazione (Conto economico voce 31)",{"$nulls":6},29,0]
["di cui:","Premi ceduti - portafoglio diretto italiano (Allegato 28 voce 11)",{"$nulls":5},30,0]
["Risultato della riassicurazione passiva - portafoglio diretto italiano (somma voci  8 dell'Allegato 27)",{"$nulls":6},{"$f":"H38+1","v":46},0]
["Provvigioni di acquisizione (Conto economico voce 66)",{"$nulls":6},{"$f":"H47+1","v":31},0]
["Altre spese di acquisizione (Conto economico voce 67)",{"$nulls":6},{"$f":"H49+1","v":32},0]
["Provvigioni di incasso (Conto economico voce 69)",{"$nulls":6},{"$f":"H50+1","v":33},0]
["Altre spese di amministrazione (Conto economico voce 70)",{"$nulls":6},{"$f":"H51+1","v":34},0]
[]
[]
["(*) ","Per le imprese che esercitano congiuntamente i rami danni e vita dovrà essere riportata la voce"]
[null,"corrispondente dell'All.2 alla Nota integrativa"]
["(**)","Tale dettaglio (voci 15, 16, 17, 18) è relativo agli investimenti di cui alla voce 54 dello Stato Patrimoniale "]
[null,"(o Allegato 2 alla Nota integrativa)."]
[]
["Sez. B"]
[]
["Informazioni relative ai titoli di debito emessi o garantiti da Stati dell'Unione Europea non destinati a permanere durevolmente nel patrimonio dell'impresa (decreto legge 29 dicembre 2011, n. 216, convertito con la legge 24 febbraio 2012, n. 14 che ha modificato il decreto legge 29 novembre 2008 convertito con la legge 28 gennaio 2009, n. 2)"]
[]
["L'impresa si è avvalsa della facoltà prevista dal Regolamento ISVAP n. 43 del 12 luglio 2012 (art. 4, comma 1),  che ha dato attuazione alle disposizioni del decreto legge 29 dicembre 2011, n. 216 convertito con la legge 24 febbraio 2012, n. 14 (che ha modificato il decreto legge 29 novembre 2008 convertito con la legge 28 gennaio 2009, n. 2), di valutare i titoli di debito emessi o garantiti da Stati dell'UE compresi nella classe C.III dello Stato Patrimoniale Attivo, non destinati a permanere durevolmente nel proprio patrimonio, all'ultimo valore approvato ai sensi del Regolamento ISVAP n. 22 del 4 aprile 2008, ovvero, per i titoli non presenti in portafoglio a tale data, al costo d'acquisizione, salvo perdite di carattere durevole, rispetto alla data del 31 dicembre 2015 (indicare SI=1 NO=0)."]
[{"$nulls":5},{"$f":"H48+1","v":47}]
[]
["A) Riserva indisponibile pari all'ammontare della differenza tra i valori iscritti in bilancio dei titoli di debito emessi o garantiti da Stati dell'UE compresi nella classe C.III dello Stato Patrimoniale Attivo per i quali è esercitata la facoltà di cui all'art. 4, comma 1, del Regolamento ISVAP n. 43 del 12 luglio 2012 ed i relativi valori desumibili dall'andamento dei mercati al 31 dicembre 2015 (Regolamento ISVAP n. 43, art. 5)"]
[]
[null,null,"- al lordo degli oneri fiscali",{"$f":"F65+1","v":48}]
[]
[]
[null,null,"- al netto degli oneri fiscali",{"$f":"D69+1","v":49}]
[]
[]
[null,"La riserva indisponibile, al netto degli oneri fiscali, è costituita da:"]
[null,null,"    - utili dell'esercizio",{"$f":"D72+1","v":50}]
[]
[null,null,"    - riserve di utili disponibili",{"$f":"D76+1","v":51}]
[]
[null,null,"    - utili degli esercizi successivi",{"$f":"D78+1","v":52}]
[]
[]
["- di cui riserva utilizzata ai fini del calcolo del margine di solvibilità disponibile\n  (Allegato n. 6 al prospetto del margine, voce 1)",null,null,{"$f":"D80+1","v":53}]
[]
[]
["B) Titoli di debito emessi o garantiti da Stati dell'UE non destinati a permanere durevolmente nel proprio patrimonio compresi nella classe C.III dello Stato Patrimoniale Attivo  per i quali l'impresa si è avvalsa della facoltà concessa dall'art. 4, comma 1, del Regolamento ISVAP n. 43  di valutarli all'ultimo valore approvato, ovvero, per i titoli non presenti nel portafoglio a tale data, al costo d'acquisizione, salvo perdite di carattere durevole, rispetto al valore desumibile dall'andamento dei mercati al 31 dicembre 2015."]
[{"$nulls":3},"Valori di bilancio",{"$nulls":3},"Valori di realizzazione\ndesumibilidall'andamento dei mercati\nal 31 dicembre 2015"]
[]
[null,null,"-  Titoli di debito emessi o garantiti da Stati dell'UE non destinati a permanere durevolmente nel proprio patrimonio compresi nella classe C.III dello Stato Patrimoniale Attivo",62,{"$nulls":3},{"$f":"D89+1","v":63}]

{"sheet":"(segue) prospetto 2","index":4,"n_rows":1011,"n_cols":8,"rows_kept":1011,"hidden":true,"merged":[[6,1,6,8],[9,1,10,1],[9,2,10,2],[9,3,10,3],[9,4,10,4],[9,5,9,6],[9,7,10,7],[1012,1,1012,2]]}
[null," ",{"$nulls":5},"(segue) Prospetto 2"]
[null,"Impresa ",{"$f":"IF(ISERROR('Foglio Informativo'!C4),\"\",'Foglio Informativo'!C4)","v":" << Fare click per selezionare la compagnia >> "},{"$nulls":4},{"$f":"IF('Foglio Informativo'!J4 = 0,\"\",'Foglio Informativo'!J4)","v":"   "}]
[null,null,"(denominazione)",{"$nulls":4},"(codice)"]
[null,"Sez. B",{"$nulls":5},"(Valori in migliaia di Euro)"]
[]
[]
[null,"C) Titoli di emittenti di cui è stata dichiarata l'insolvenza o per i quali sono state avviate procedure concursuali (es. Lehman Brothers) "]
[null,"* i titoli devono essere riportati nell'elenco, in ordine decrescente, sulla base dell'esposizione totale di ogni singolo emittente "]
[null,"**la classe dello \"Stato  Patrimoniale - Gestione vita\" da inserire può essere la \"C\", la \"D.I\" o la \"D.II\""]
[null,"denominazione emittente *","denominazione titolo","Codice ISIN","Valori di bilancio","Tasso di recupero (recovery rate) utilizzato per la valutazione di bilancio",null," Classe dello                           Stato Patrimoniale - Gestione Vita                       alla quale appartertengono i titoli** "]
[{"$nulls":5},"Parte intera","Parte decimale"]
[{"$nulls":4},0,0,0]
[{"$nulls":4},0,0,0]
[{"$nulls":4},0,0,0]
[{"$nulls":4},0,0,0]
[{"$nulls":4},0,0,0]
[{"$nulls":4},0,0,0]
[{"$nulls":4},0,0,0]
[{"$nulls":4},0,0,0]
[{"$nulls":4},0,0,0]
[{"$nulls":4},0,0,0]
[{"$nulls":4},0,0,0]
[{"$nulls":4},0,0,0]
[{"$nulls":4},0,0,0]
[{"$nulls":4},0,0,0]
[{"$nulls":4},0,0,0]
[{"$nulls":4},0,0,0]
[{"$nulls":4},0,0,0]
[{"$nulls":4},0,0,0]
[{"$nulls":4},0,0,0]
[{"$nulls":4},0,0,0]
[{"$nulls":4},0,0,0]
[{"$nulls":4},0,0,0]
[{"$nulls":4},0,0,0]
[{"$nulls":4},0,0,0]
[{"$nulls":4},0,0,0]
[{"$nulls":4},0,0,0]
[{"$nulls":4},0,0,0]
[{"$nulls":4},0,0,0]
[{"$nulls":4},0,0,0]
[{"$nulls":4},0,0,0]
[{"$nulls":4},0,0,0]
[{"$nulls":4},0,0,0]
[{"$nulls":4},0,0,0]
[{"$nulls":4},0,0,0]
[{"$nulls":4},0,0,0]
[{"$nulls":4},0,0,0]
[{"$nulls":4},0,0,0]
[{"$nulls":4},0,0,0]
[{"$nulls":4},0,0,0]
[{"$nulls":4},0,0,0]
[{"$nulls":4},0,0,0]
[{"$nulls":4},0,0,0]
[{"$nulls":4},0,0,0]
[{"$nulls":4},0,0,0]
[{"$nulls":4},0,0,0]
[{"$nulls":4},0,0,0]
[{"$nulls":4},0,0,0]
[{"$nulls":4},0,0,0]
[{"$nulls":4},0,0,0]
[{"$nulls":4},0,0,0]
[{"$nulls":4},0,0,0]
[{"$nulls":4},0,0,0]
[{"$nulls":4},0,0,0]
[{"$nulls":4},0,0,0]
[{"$nulls":4},0,0,0]
[{"$nulls":4},0,0,0]
[{"$nulls":4},0,0,0]
[{"$nulls":4},0,0,0]
[{"$nulls":4},0,0,0]
[{"$nulls":4},0,0,0]
[{"$nulls":4},0,0,0]
[{"$nulls":4},0,0,0]
[{"$nulls":4},0,0,0]
[{"$nulls":4},0,0,0]
[{"$nulls":4},0,0,0]
[{"$nulls":4},0,0,0]
[{"$nulls":4},0,0,0]
[{"$nulls":4},0,0,0]
[{"$nulls":4},0,0,0]
[{"$nulls":4},0,0,0]
[{"$nulls":4},0,0,0]
[{"$nulls":4},0,0,0]
[{"$nulls":4},0,0,0]
[{"$nulls":4},0,0,0]
[{"$nulls":4},0,0,0]
[{"$nulls":4},0,0,0]
[{"$nulls":4},0,0,0]
[{"$nulls":4},0,0,0]
[{"$nulls":4},0,0,0]
[{"$nulls":4},0,0,0]
[{"$nulls":4},0,0,0]
[{"$nulls":4},0,0,0]
[{"$nulls":4},0,0,0]
[{"$nulls":4},0,0,0]
[{"$nulls":4},0,0,0]
[{"$nulls":4},0,0,0]
[{"$nulls":4},0,0,0]
[{"$nulls":4},0,0,0]
[{"$nulls":4},0,0,0]
[{"$nulls":4},0,0,0]
[{"$nulls":4},0,0,0]
[{"$nulls":4},0,0,0]
[{"$nulls":4},0,0,0]
[{"$nulls":4},0,0,0]
[{"$nulls":4},0,0,0]
[{"$nulls":4},0,0,0]
[{"$nulls":4},0,0,0]
[{"$nulls":4},0,0,0]
[{"$nulls":4},0,0,0]
[{"$nulls":4},0,0,0]
[{"$nulls":4},0,0,0]
[{"$nulls":4},0,0,0]
[{"$nulls":4},0,0,0]
[{"$nulls":4},0,0,0]
[{"$nulls":4},0,0,0]
[{"$nulls":4},0,0,0]
[{"$nulls":4},0,0,0]
[{"$nulls":4},0,0,0]
[{"$nulls":4},0,0,0]
[{"$nulls":4},0,0,0]
[{"$nulls":4},0,0,0]
[{"$nulls":4},0,0,0]
[{"$nulls":4},0,0,0]
[{"$nulls":4},0,0,0]
[{"$nulls":4},0,0,0]
[{"$nulls":4},0,0,0]
[{"$nulls":4},0,0,0]
[{"$nulls":4},0,0,0]
[{"$nulls":4},0,0,0]
[{"$nulls":4},0,0,0]
[{"$nulls":4},0,0,0]
[{"$nulls":4},0,0,0]
[{"$nulls":4},0,0,0]
[{"$nulls":4},0,0,0]
[{"$nulls":4},0,0,0]
[{"$nulls":4},0,0,0]
[{"$nulls":4},0,0,0]
[{"$nulls":4},0,0,0]
[{"$nulls":4},0,0,0]
[{"$nulls":4},0,0,0]
[{"$nulls":4},0,0,0]
[{"$nulls":4},0,0,0]
[{"$nulls":4},0,0,0]
[{"$nulls":4},0,0,0]
[{"$nulls":4},0,0,0]
[{"$nulls":4},0,0,0]
[{"$nulls":4},0,0,0]
[{"$nulls":4},0,0,0]
[{"$nulls":4},0,0,0]
[{"$nulls":4},0,0,0]
[{"$nulls":4},0,0,0]
[{"$nulls":4},0,0,0]
[{"$nulls":4},0,0,0]
[{"$nulls":4},0,0,0]
[{"$nulls":4},0,0,0]
[{"$nulls":4},0,0,0]
[{"$nulls":4},0,0,0]
[{"$nulls":4},0,0,0]
[{"$nulls":4},0,0,0]
[{"$nulls":4},0,0,0]
[{"$nulls":4},0,0,0]
[{"$nulls":4},0,0,0]
[{"$nulls":4},0,0,0]
[{"$nulls":4},0,0,0]
[{"$nulls":4},0,0,0]
[{"$nulls":4},0,0,0]
[{"$nulls":4},0,0,0]
[{"$nulls":4},0,0,0]
[{"$nulls":4},0,0,0]
[{"$nulls":4},0,0,0]
[{"$nulls":4},0,0,0]
[{"$nulls":4},0,0,0]
[{"$nulls":4},0,0,0]
[{"$nulls":4},0,0,0]
[{"$nulls":4},0,0,0]
[{"$nulls":4},0,0,0]
[{"$nulls":4},0,0,0]
[{"$nulls":4},0,0,0]
[{"$nulls":4},0,0,0]
[{"$nulls":4},0,0,0]
[{"$nulls":4},0,0,0]
[{"$nulls":4},0,0,0]
[{"$nulls":4},0,0,0]
[{"$nulls":4},0,0,0]
[{"$nulls":4},0,0,0]
[{"$nulls":4},0,0,0]
[{"$nulls":4},0,0,0]
[{"$nulls":4},0,0,0]
[{"$nulls":4},0,0,0]
[{"$nulls":4},0,0,0]
[{"$nulls":4},0,0,0]
[{"$nulls":4},0,0,0]
[{"$nulls":4},0,0,0]
[{"$nulls":4},0,0,0]
[{"$nulls":4},0,0,0]
[{"$nulls":4},0,0,0]
[{"$nulls":4},0,0,0]
[{"$nulls":4},0,0,0]
[{"$nulls":4},0,0,0]
[{"$nulls":4},0,0,0]
[{"$nulls":4},0,0,0]
[{"$nulls":4},0,0,0]
[{"$nulls":4},0,0,0]
[{"$nulls":4},0,0,0]
[{"$nulls":4},0,0,0]
[{"$nulls":4},0,0,0]
[{"$nulls":4},0,0,0]
[{"$nulls":4},0,0,0]
[{"$nulls":4},0,0,0]
[{"$nulls":4},0,0,0]
[{"$nulls":4},0,0,0]
[{"$nulls":4},0,0,0]
[{"$nulls":4},0,0,0]
[{"$nulls":4},0,0,0]
[{"$nulls":4},0,0,0]
[{"$nulls":4},0,0,0]
[{"$nulls":4},0,0,0]
[{"$nulls":4},0,0,0]
[{"$nulls":4},0,0,0]
[{"$nulls":4},0,0,0]
[{"$nulls":4},0,0,0]
[{"$nulls":4},0,0,0]
[{"$nulls":4},0,0,0]
[{"$nulls":4},0,0,0]
[{"$nulls":4},0,0,0]
[{"$nulls":4},0,0,0]
[{"$nulls":4},0,0,0]
[{"$nulls":4},0,0,0]
[{"$nulls":4},0,0,0]
[{"$nulls":4},0,0,0]
[{"$nulls":4},0,0,0]
[{"$nulls":4},0,0,0]
[{"$nulls":4},0,0,0]
[{"$nulls":4},0,0,0]
[{"$nulls":4},0,0,0]
[{"$nulls":4},0,0,0]
[{"$nulls":4},0,0,0]
[{"$nulls":4},0,0,0]
[{"$nulls":4},0,0,0]
[{"$nulls":4},0,0,0]
[{"$nulls":4},0,0,0]
[{"$nulls":4},0,0,0]
[{"$nulls":4},0,0,0]
[{"$nulls":4},0,0,0]
[{"$nulls":4},0,0,0]
[{"$nulls":4},0,0,0]
[{"$nulls":4},0,0,0]
[{"$nulls":4},0,0,0]
[{"$nulls":4},0,0,0]
[{"$nulls":4},0,0,0]
[{"$nulls":4},0,0,0]
[{"$nulls":4},0,0,0]
[{"$nulls":4},0,0,0]
[{"$nulls":4},0,0,0]
[{"$nulls":4},0,0,0]
[{"$nulls":4},0,0,0]
[{"$nulls":4},0,0,0]
[{"$nulls":4},0,0,0]
[{"$nulls":4},0,0,0]
[{"$nulls":4},0,0,0]
[{"$nulls":4},0,0,0]
[{"$nulls":4},0,0,0]
[{"$nulls":4},0,0,0]
[{"$nulls":4},0,0,0]
[{"$nulls":4},0,0,0]
[{"$nulls":4},0,0,0]
[{"$nulls":4},0,0,0]
[{"$nulls":4},0,0,0]
[{"$nulls":4},0,0,0]
[{"$nulls":4},0,0,0]
[{"$nulls":4},0,0,0]
[{"$nulls":4},0,0,0]
[{"$nulls":4},0,0,0]
[{"$nulls":4},0,0,0]
[{"$nulls":4},0,0,0]
[{"$nulls":4},0,0,0]
[{"$nulls":4},0,0,0]
[{"$nulls":4},0,0,0]
[{"$nulls":4},0,0,0]
[{"$nulls":4},0,0,0]
[{"$nulls":4},0,0,0]
[{"$nulls":4},0,0,0]
[{"$nulls":4},0,0,0]
[{"$nulls":4},0,0,0]
[{"$nulls":4},0,0,0]
[{"$nulls":4},0,0,0]
[{"$nulls":4},0,0,0]
[{"$nulls":4},0,0,0]
[{"$nulls":4},0,0,0]
[{"$nulls":4},0,0,0]
[{"$nulls":4},0,0,0]
[{"$nulls":4},0,0,0]
[{"$nulls":4},0,0,0]
[{"$nulls":4},0,0,0]
[{"$nulls":4},0,0,0]
[{"$nulls":4},0,0,0]
[{"$nulls":4},0,0,0]
[{"$nulls":4},0,0,0]
[{"$nulls":4},0,0,0]
[{"$nulls":4},0,0,0]
[{"$nulls":4},0,0,0]
[{"$nulls":4},0,0,0]
[{"$nulls":4},0,0,0]
[{"$nulls":4},0,0,0]
[{"$nulls":4},0,0,0]
[{"$nulls":4},0,0,0]
[{"$nulls":4},0,0,0]
[{"$nulls":4},0,0,0]
[{"$nulls":4},0,0,0]
[{"$nulls":4},0,0,0]
[{"$nulls":4},0,0,0]
[{"$nulls":4},0,0,0]
[{"$nulls":4},0,0,0]
[{"$nulls":4},0,0,0]
[{"$nulls":4},0,0,0]
[{"$nulls":4},0,0,0]
[{"$nulls":4},0,0,0]
[{"$nulls":4},0,0,0]
[{"$nulls":4},0,0,0]
[{"$nulls":4},0,0,0]
[{"$nulls":4},0,0,0]
[{"$nulls":4},0,0,0]
[{"$nulls":4},0,0,0]
[{"$nulls":4},0,0,0]
[{"$nulls":4},0,0,0]
[{"$nulls":4},0,0,0]
[{"$nulls":4},0,0,0]
[{"$nulls":4},0,0,0]
[{"$nulls":4},0,0,0]
[{"$nulls":4},0,0,0]
[{"$nulls":4},0,0,0]
[{"$nulls":4},0,0,0]
[{"$nulls":4},0,0,0]
[{"$nulls":4},0,0,0]
[{"$nulls":4},0,0,0]
[{"$nulls":4},0,0,0]
[{"$nulls":4},0,0,0]
[{"$nulls":4},0,0,0]
[{"$nulls":4},0,0,0]
[{"$nulls":4},0,0,0]
[{"$nulls":4},0,0,0]
[{"$nulls":4},0,0,0]
[{"$nulls":4},0,0,0]
[{"$nulls":4},0,0,0]
[{"$nulls":4},0,0,0]
[{"$nulls":4},0,0,0]
[{"$nulls":4},0,0,0]
[{"$nulls":4},0,0,0]
[{"$nulls":4},0,0,0]
[{"$nulls":4},0,0,0]
[{"$nulls":4},0,0,0]
[{"$nulls":4},0,0,0]
[{"$nulls":4},0,0,0]
[{"$nulls":4},0,0,0]
[{"$nulls":4},0,0,0]
[{"$nulls":4},0,0,0]
[{"$nulls":4},0,0,0]
[{"$nulls":4},0,0,0]
[{"$nulls":4},0,0,0]
[{"$nulls":4},0,0,0]
[{"$nulls":4},0,0,0]
[{"$nulls":4},0,0,0]
[{"$nulls":4},0,0,0]
[{"$nulls":4},0,0,0]
[{"$nulls":4},0,0,0]
[{"$nulls":4},0,0,0]
[{"$nulls":4},0,0,0]
[{"$nulls":4},0,0,0]
[{"$nulls":4},0,0,0]
[{"$nulls":4},0,0,0]
[{"$nulls":4},0,0,0]
[{"$nulls":4},0,0,0]
[{"$nulls":4},0,0,0]
[{"$nulls":4},0,0,0]
[{"$nulls":4},0,0,0]
[{"$nulls":4},0,0,0]
[{"$nulls":4},0,0,0]
[{"$nulls":4},0,0,0]
[{"$nulls":4},0,0,0]
[{"$nulls":4},0,0,0]
[{"$nulls":4},0,0,0]
[{"$nulls":4},0,0,0]
[{"$nulls":4},0,0,0]
[{"$nulls":4},0,0,0]
[{"$nulls":4},0,0,0]
[{"$nulls":4},0,0,0]
[{"$nulls":4},0,0,0]
[{"$nulls":4},0,0,0]
[{"$nulls":4},0,0,0]
[{"$nulls":4},0,0,0]
[{"$nulls":4},0,0,0]
[{"$nulls":4},0,0,0]
[{"$nulls":4},0,0,0]
[{"$nulls":4},0,0,0]
[{"$nulls":4},0,0,0]
[{"$nulls":4},0,0,0]
[{"$nulls":4},0,0,0]
[{"$nulls":4},0,0,0]
[{"$nulls":4},0,0,0]
[{"$nulls":4},0,0,0]
[{"$nulls":4},0,0,0]
[{"$nulls":4},0,0,0]
[{"$nulls":4},0,0,0]
[{"$nulls":4},0,0,0]
[{"$nulls":4},0,0,0]
[{"$nulls":4},0,0,0]
[{"$nulls":4},0,0,0]
[{"$nulls":4},0,0,0]
[{"$nulls":4},0,0,0]
[{"$nulls":4},0,0,0]
[{"$nulls":4},0,0,0]
[{"$nulls":4},0,0,0]
[{"$nulls":4},0,0,0]
[{"$nulls":4},0,0,0]
[{"$nulls":4},0,0,0]
[{"$nulls":4},0,0,0]
[{"$nulls":4},0,0,0]
[{"$nulls":4},0,0,0]
[{"$nulls":4},0,0,0]
[{"$nulls":4},0,0,0]
[{"$nulls":4},0,0,0]
[{"$nulls":4},0,0,0]
[{"$nulls":4},0,0,0]
[{"$nulls":4},0,0,0]
[{"$nulls":4},0,0,0]
[{"$nulls":4},0,0,0]
[{"$nulls":4},0,0,0]
[{"$nulls":4},0,0,0]
[{"$nulls":4},0,0,0]
[{"$nulls":4},0,0,0]
[{"$nulls":4},0,0,0]
[{"$nulls":4},0,0,0]
[{"$nulls":4},0,0,0]
[{"$nulls":4},0,0,0]
[{"$nulls":4},0,0,0]
[{"$nulls":4},0,0,0]
[{"$nulls":4},0,0,0]
[{"$nulls":4},0,0,0]
[{"$nulls":4},0,0,0]
[{"$nulls":4},0,0,0]
[{"$nulls":4},0,0,0]
[{"$nulls":4},0,0,0]
[{"$nulls":4},0,0,0]
[{"$nulls":4},0,0,0]
[{"$nulls":4},0,0,0]
[{"$nulls":4},0,0,0]
[{"$nulls":4},0,0,0]
[{"$nulls":4},0,0,0]
[{"$nulls":4},0,0,0]
[{"$nulls":4},0,0,0]
[{"$nulls":4},0,0,0]
[{"$nulls":4},0,0,0]
[{"$nulls":4},0,0,0]
[{"$nulls":4},0,0,0]
[{"$nulls":4},0,0,0]
[{"$nulls":4},0,0,0]
[{"$nulls":4},0,0,0]
[{"$nulls":4},0,0,0]
[{"$nulls":4},0,0,0]
[{"$nulls":4},0,0,0]
[{"$nulls":4},0,0,0]
[{"$nulls":4},0,0,0]
[{"$nulls":4},0,0,0]
[{"$nulls":4},0,0,0]
[{"$nulls":4},0,0,0]
[{"$nulls":4},0,0,0]
[{"$nulls":4},0,0,0]
[{"$nulls":4},0,0,0]
[{"$nulls":4},0,0,0]
[{"$nulls":4},0,0,0]
[{"$nulls":4},0,0,0]
[{"$nulls":4},0,0,0]
[{"$nulls":4},0,0,0]
[{"$nulls":4},0,0,0]
[{"$nulls":4},0,0,0]
[{"$nulls":4},0,0,0]
[{"$nulls":4},0,0,0]
[{"$nulls":4},0,0,0]
[{"$nulls":4},0,0,0]
[{"$nulls":4},0,0,0]
[{"$nulls":4},0,0,0]
[{"$nulls":4},0,0,0]
[{"$nulls":4},0,0,0]
[{"$nulls":4},0,0,0]
[{"$nulls":4},0,0,0]
[{"$nulls":4},0,0,0]
[{"$nulls":4},0,0,0]
[{"$nulls":4},0,0,0]
[{"$nulls":4},0,0,0]
[{"$nulls":4},0,0,0]
[{"$nulls":4},0,0,0]
[{"$nulls":4},0,0,0]
[{"$nulls":4},0,0,0]
[{"$nulls":4},0,0,0]
[{"$nulls":4},0,0,0]
[{"$nulls":4},0,0,0]
[{"$nulls":4},0,0,0]
[{"$nulls":4},0,0,0]
[{"$nulls":4},0,0,0]
[{"$nulls":4},0,0,0]
[{"$nulls":4},0,0,0]
[{"$nulls":4},0,0,0]
[{"$nulls":4},0,0,0]
[{"$nulls":4},0,0,0]
[{"$nulls":4},0,0,0]
[{"$nulls":4},0,0,0]
[{"$nulls":4},0,0,0]
[{"$nulls":4},0,0,0]
[{"$nulls":4},0,0,0]
[{"$nulls":4},0,0,0]
[{"$nulls":4},0,0,0]
[{"$nulls":4},0,0,0]
[{"$nulls":4},0,0,0]
[{"$nulls":4},0,0,0]
[{"$nulls":4},0,0,0]
[{"$nulls":4},0,0,0]
[{"$nulls":4},0,0,0]
[{"$nulls":4},0,0,0]
[{"$nulls":4},0,0,0]
[{"$nulls":4},0,0,0]
[{"$nulls":4},0,0,0]
[{"$nulls":4},0,0,0]
[{"$nulls":4},0,0,0]
[{"$nulls":4},0,0,0]
[{"$nulls":4},0,0,0]
[{"$nulls":4},0,0,0]
[{"$nulls":4},0,0,0]
[{"$nulls":4},0,0,0]
[{"$nulls":4},0,0,0]
[{"$nulls":4},0,0,0]
[{"$nulls":4},0,0,0]
[{"$nulls":4},0,0,0]
[{"$nulls":4},0,0,0]
[{"$nulls":4},0,0,0]
[{"$nulls":4},0,0,0]
[{"$nulls":4},0,0,0]
[{"$nulls":4},0,0,0]
[{"$nulls":4},0,0,0]
[{"$nulls":4},0,0,0]
[{"$nulls":4},0,0,0]
[{"$nulls":4},0,0,0]
[{"$nulls":4},0,0,0]
[{"$nulls":4},0,0,0]
[{"$nulls":4},0,0,0]
[{"$nulls":4},0,0,0]
[{"$nulls":4},0,0,0]
[{"$nulls":4},0,0,0]
[{"$nulls":4},0,0,0]
[{"$nulls":4},0,0,0]
[{"$nulls":4},0,0,0]
[{"$nulls":4},0,0,0]
[{"$nulls":4},0,0,0]
[{"$nulls":4},0,0,0]
[{"$nulls":4},0,0,0]
[{"$nulls":4},0,0,0]
[{"$nulls":4},0,0,0]
[{"$nulls":4},0,0,0]
[{"$nulls":4},0,0,0]
[{"$nulls":4},0,0,0]
[{"$nulls":4},0,0,0]
[{"$nulls":4},0,0,0]
[{"$nulls":4},0,0,0]
[{"$nulls":4},0,0,0]
[{"$nulls":4},0,0,0]
[{"$nulls":4},0,0,0]
[{"$nulls":4},0,0,0]
[{"$nulls":4},0,0,0]
[{"$nulls":4},0,0,0]
[{"$nulls":4},0,0,0]
[{"$nulls":4},0,0,0]
[{"$nulls":4},0,0,0]
[{"$nulls":4},0,0,0]
[{"$nulls":4},0,0,0]
[{"$nulls":4},0,0,0]
[{"$nulls":4},0,0,0]
[{"$nulls":4},0,0,0]
[{"$nulls":4},0,0,0]
[{"$nulls":4},0,0,0]
[{"$nulls":4},0,0,0]
[{"$nulls":4},0,0,0]
[{"$nulls":4},0,0,0]
[{"$nulls":4},0,0,0]
[{"$nulls":4},0,0,0]
[{"$nulls":4},0,0,0]
[{"$nulls":4},0,0,0]
[{"$nulls":4},0,0,0]
[{"$nulls":4},0,0,0]
[{"$nulls":4},0,0,0]
[{"$nulls":4},0,0,0]
[{"$nulls":4},0,0,0]
[{"$nulls":4},0,0,0]
[{"$nulls":4},0,0,0]
[{"$nulls":4},0,0,0]
[{"$nulls":4},0,0,0]
[{"$nulls":4},0,0,0]
[{"$nulls":4},0,0,0]
[{"$nulls":4},0,0,0]
[{"$nulls":4},0,0,0]
[{"$nulls":4},0,0,0]
[{"$nulls":4},0,0,0]
[{"$nulls":4},0,0,0]
[{"$nulls":4},0,0,0]
[{"$nulls":4},0,0,0]
[{"$nulls":4},0,0,0]
[{"$nulls":4},0,0,0]
[{"$nulls":4},0,0,0]
[{"$nulls":4},0,0,0]
[{"$nulls":4},0,0,0]
[{"$nulls":4},0,0,0]
[{"$nulls":4},0,0,0]
[{"$nulls":4},0,0,0]
[{"$nulls":4},0,0,0]
[{"$nulls":4},0,0,0]
[{"$nulls":4},0,0,0]
[{"$nulls":4},0,0,0]
[{"$nulls":4},0,0,0]
[{"$nulls":4},0,0,0]
[{"$nulls":4},0,0,0]
[{"$nulls":4},0,0,0]
[{"$nulls":4},0,0,0]
[{"$nulls":4},0,0,0]
[{"$nulls":4},0,0,0]
[{"$nulls":4},0,0,0]
[{"$nulls":4},0,0,0]
[{"$nulls":4},0,0,0]
[{"$nulls":4},0,0,0]
[{"$nulls":4},0,0,0]
[{"$nulls":4},0,0,0]
[{"$nulls":4},0,0,0]
[{"$nulls":4},0,0,0]
[{"$nulls":4},0,0,0]
[{"$nulls":4},0,0,0]
[{"$nulls":4},0,0,0]
[{"$nulls":4},0,0,0]
[{"$nulls":4},0,0,0]
[{"$nulls":4},0,0,0]
[{"$nulls":4},0,0,0]
[{"$nulls":4},0,0,0]
[{"$nulls":4},0,0,0]
[{"$nulls":4},0,0,0]
[{"$nulls":4},0,0,0]
[{"$nulls":4},0,0,0]
[{"$nulls":4},0,0,0]
[{"$nulls":4},0,0,0]
[{"$nulls":4},0,0,0]
[{"$nulls":4},0,0,0]
[{"$nulls":4},0,0,0]
[{"$nulls":4},0,0,0]
[{"$nulls":4},0,0,0]
[{"$nulls":4},0,0,0]
[{"$nulls":4},0,0,0]
[{"$nulls":4},0,0,0]
[{"$nulls":4},0,0,0]
[{"$nulls":4},0,0,0]
[{"$nulls":4},0,0,0]
[{"$nulls":4},0,0,0]
[{"$nulls":4},0,0,0]
[{"$nulls":4},0,0,0]
[{"$nulls":4},0,0,0]
[{"$nulls":4},0,0,0]
[{"$nulls":4},0,0,0]
[{"$nulls":4},0,0,0]
[{"$nulls":4},0,0,0]
[{"$nulls":4},0,0,0]
[{"$nulls":4},0,0,0]
[{"$nulls":4},0,0,0]
[{"$nulls":4},0,0,0]
[{"$nulls":4},0,0,0]
[{"$nulls":4},0,0,0]
[{"$nulls":4},0,0,0]
[{"$nulls":4},0,0,0]
[{"$nulls":4},0,0,0]
[{"$nulls":4},0,0,0]
[{"$nulls":4},0,0,0]
[{"$nulls":4},0,0,0]
[{"$nulls":4},0,0,0]
[{"$nulls":4},0,0,0]
[{"$nulls":4},0,0,0]
[{"$nulls":4},0,0,0]
[{"$nulls":4},0,0,0]
[{"$nulls":4},0,0,0]
[{"$nulls":4},0,0,0]
[{"$nulls":4},0,0,0]
[{"$nulls":4},0,0,0]
[{"$nulls":4},0,0,0]
[{"$nulls":4},0,0,0]
[{"$nulls":4},0,0,0]
[{"$nulls":4},0,0,0]
[{"$nulls":4},0,0,0]
[{"$nulls":4},0,0,0]
[{"$nulls":4},0,0,0]
[{"$nulls":4},0,0,0]
[{"$nulls":4},0,0,0]
[{"$nulls":4},0,0,0]
[{"$nulls":4},0,0,0]
[{"$nulls":4},0,0,0]
[{"$nulls":4},0,0,0]
[{"$nulls":4},0,0,0]
[{"$nulls":4},0,0,0]
[{"$nulls":4},0,0,0]
[{"$nulls":4},0,0,0]
[{"$nulls":4},0,0,0]
[{"$nulls":4},0,0,0]
[{"$nulls":4},0,0,0]
[{"$nulls":4},0,0,0]
[{"$nulls":4},0,0,0]
[{"$nulls":4},0,0,0]
[{"$nulls":4},0,0,0]
[{"$nulls":4},0,0,0]
[{"$nulls":4},0,0,0]
[{"$nulls":4},0,0,0]
[{"$nulls":4},0,0,0]
[{"$nulls":4},0,0,0]
[{"$nulls":4},0,0,0]
[{"$nulls":4},0,0,0]
[{"$nulls":4},0,0,0]
[{"$nulls":4},0,0,0]
[{"$nulls":4},0,0,0]
[{"$nulls":4},0,0,0]
[{"$nulls":4},0,0,0]
[{"$nulls":4},0,0,0]
[{"$nulls":4},0,0,0]
[{"$nulls":4},0,0,0]
[{"$nulls":4},0,0,0]
[{"$nulls":4},0,0,0]
[{"$nulls":4},0,0,0]
[{"$nulls":4},0,0,0]
[{"$nulls":4},0,0,0]
[{"$nulls":4},0,0,0]
[{"$nulls":4},0,0,0]
[{"$nulls":4},0,0,0]
[{"$nulls":4},0,0,0]
[{"$nulls":4},0,0,0]
[{"$nulls":4},0,0,0]
[{"$nulls":4},0,0,0]
[{"$nulls":4},0,0,0]
[{"$nulls":4},0,0,0]
[{"$nulls":4},0,0,0]
[{"$nulls":4},0,0,0]
[{"$nulls":4},0,0,0]
[{"$nulls":4},0,0,0]
[{"$nulls":4},0,0,0]
[{"$nulls":4},0,0,0]
[{"$nulls":4},0,0,0]
[{"$nulls":4},0,0,0]
[{"$nulls":4},0,0,0]
[{"$nulls":4},0,0,0]
[{"$nulls":4},0,0,0]
[{"$nulls":4},0,0,0]
[{"$nulls":4},0,0,0]
[{"$nulls":4},0,0,0]
[{"$nulls":4},0,0,0]
[{"$nulls":4},0,0,0]
[{"$nulls":4},0,0,0]
[{"$nulls":4},0,0,0]
[{"$nulls":4},0,0,0]
[{"$nulls":4},0,0,0]
[{"$nulls":4},0,0,0]
[{"$nulls":4},0,0,0]
[{"$nulls":4},0,0,0]
[{"$nulls":4},0,0,0]
[{"$nulls":4},0,0,0]
[{"$nulls":4},0,0,0]
[{"$nulls":4},0,0,0]
[{"$nulls":4},0,0,0]
[{"$nulls":4},0,0,0]
[{"$nulls":4},0,0,0]
[{"$nulls":4},0,0,0]
[{"$nulls":4},0,0,0]
[{"$nulls":4},0,0,0]
[{"$nulls":4},0,0,0]
[{"$nulls":4},0,0,0]
[{"$nulls":4},0,0,0]
[{"$nulls":4},0,0,0]
[{"$nulls":4},0,0,0]
[{"$nulls":4},0,0,0]
[{"$nulls":4},0,0,0]
[{"$nulls":4},0,0,0]
[{"$nulls":4},0,0,0]
[{"$nulls":4},0,0,0]
[{"$nulls":4},0,0,0]
[{"$nulls":4},0,0,0]
[{"$nulls":4},0,0,0]
[{"$nulls":4},0,0,0]
[{"$nulls":4},0,0,0]
[{"$nulls":4},0,0,0]
[{"$nulls":4},0,0,0]
[{"$nulls":4},0,0,0]
[{"$nulls":4},0,0,0]
[{"$nulls":4},0,0,0]
[{"$nulls":4},0,0,0]
[{"$nulls":4},0,0,0]
[{"$nulls":4},0,0,0]
[{"$nulls":4},0,0,0]
[{"$nulls":4},0,0,0]
[{"$nulls":4},0,0,0]
[{"$nulls":4},0,0,0]
[{"$nulls":4},0,0,0]
[{"$nulls":4},0,0,0]
[{"$nulls":4},0,0,0]
[{"$nulls":4},0,0,0]
[{"$nulls":4},0,0,0]
[{"$nulls":4},0,0,0]
[{"$nulls":4},0,0,0]
[{"$nulls":4},0,0,0]
[{"$nulls":4},0,0,0]
[{"$nulls":4},0,0,0]
[{"$nulls":4},0,0,0]
[{"$nulls":4},0,0,0]
[{"$nulls":4},0,0,0]
[{"$nulls":4},0,0,0]
[{"$nulls":4},0,0,0]
[{"$nulls":4},0,0,0]
[{"$nulls":4},0,0,0]
[{"$nulls":4},0,0,0]
[{"$nulls":4},0,0,0]
[{"$nulls":4},0,0,0]
[{"$nulls":4},0,0,0]
[{"$nulls":4},0,0,0]
[{"$nulls":4},0,0,0]
[{"$nulls":4},0,0,0]
[{"$nulls":4},0,0,0]
[{"$nulls":4},0,0,0]
[{"$nulls":4},0,0,0]
[{"$nulls":4},0,0,0]
[{"$nulls":4},0,0,0]
[{"$nulls":4},0,0,0]
[{"$nulls":4},0,0,0]
[{"$nulls":4},0,0,0]
[{"$nulls":4},0,0,0]
[{"$nulls":4},0,0,0]
[{"$nulls":4},0,0,0]
[{"$nulls":4},0,0,0]
[{"$nulls":4},0,0,0]
[{"$nulls":4},0,0,0]
[{"$nulls":4},0,0,0]
[{"$nulls":4},0,0,0]
[{"$nulls":4},0,0,0]
[{"$nulls":4},0,0,0]
[{"$nulls":4},0,0,0]
[{"$nulls":4},0,0,0]
[{"$nulls":4},0,0,0]
[{"$nulls":4},0,0,0]
[{"$nulls":4},0,0,0]
[{"$nulls":4},0,0,0]
[{"$nulls":4},0,0,0]
[{"$nulls":4},0,0,0]
[{"$nulls":4},0,0,0]
[{"$nulls":4},0,0,0]
[{"$nulls":4},0,0,0]
[{"$nulls":4},0,0,0]
[{"$nulls":4},0,0,0]
[{"$nulls":4},0,0,0]
[{"$nulls":4},0,0,0]
[{"$nulls":4},0,0,0]
[{"$nulls":4},0,0,0]
[{"$nulls":4},0,0,0]
[{"$nulls":4},0,0,0]
[{"$nulls":4},0,0,0]
[{"$nulls":4},0,0,0]
[{"$nulls":4},0,0,0]
[{"$nulls":4},0,0,0]
[{"$nulls":4},0,0,0]
[{"$nulls":4},0,0,0]
[{"$nulls":4},0,0,0]
[{"$nulls":4},0,0,0]
[{"$nulls":4},0,0,0]
[{"$nulls":4},0,0,0]
[{"$nulls":4},0,0,0]
[{"$nulls":4},0,0,0]
[{"$nulls":4},0,0,0]
[{"$nulls":4},0,0,0]
[{"$nulls":4},0,0,0]
[{"$nulls":4},0,0,0]
[{"$nulls":4},0,0,0]
[{"$nulls":4},0,0,0]
[{"$nulls":4},0,0,0]
[{"$nulls":4},0,0,0]
[{"$nulls":4},0,0,0]
[{"$nulls":4},0,0,0]
[{"$nulls":4},0,0,0]
[{"$nulls":4},0,0,0]
[{"$nulls":4},0,0,0]
[{"$nulls":4},0,0,0]
[{"$nulls":4},0,0,0]
[{"$nulls":4},0,0,0]
[{"$nulls":4},0,0,0]
[{"$nulls":4},0,0,0]
[{"$nulls":4},0,0,0]
[{"$nulls":4},0,0,0]
[{"$nulls":4},0,0,0]
[{"$nulls":4},0,0,0]
[{"$nulls":4},0,0,0]
[{"$nulls":4},0,0,0]
[{"$nulls":4},0,0,0]
[{"$nulls":4},0,0,0]
[{"$nulls":4},0,0,0]
[{"$nulls":4},0,0,0]
[{"$nulls":4},0,0,0]
[{"$nulls":4},0,0,0]
[{"$nulls":4},0,0,0]
[{"$nulls":4},0,0,0]
[{"$nulls":4},0,0,0]
[{"$nulls":4},0,0,0]
[{"$nulls":4},0,0,0]
[{"$nulls":4},0,0,0]
[{"$nulls":4},0,0,0]
[{"$nulls":4},0,0,0]
[{"$nulls":4},0,0,0]
[{"$nulls":4},0,0,0]
[{"$nulls":4},0,0,0]
[{"$nulls":4},0,0,0]
[{"$nulls":4},0,0,0]
[{"$nulls":4},0,0,0]
[{"$nulls":4},0,0,0]
[{"$nulls":4},0,0,0]
[{"$nulls":4},0,0,0]
[{"$nulls":4},0,0,0]
[{"$nulls":4},0,0,0]
[{"$nulls":4},0,0,0]
[{"$nulls":4},0,0,0]
[{"$nulls":4},0,0,0]
[{"$nulls":4},0,0,0]
[{"$nulls":4},0,0,0]
[{"$nulls":4},0,0,0]
[{"$nulls":4},0,0,0]
[{"$nulls":4},0,0,0]
[{"$nulls":4},0,0,0]
[{"$nulls":4},0,0,0]
[{"$nulls":4},0,0,0]
[{"$nulls":4},0,0,0]
[{"$nulls":4},0,0,0]
[{"$nulls":4},0,0,0]
[{"$nulls":4},0,0,0]
[{"$nulls":4},0,0,0]
[{"$nulls":4},0,0,0]
[{"$nulls":4},0,0,0]
[{"$nulls":4},0,0,0]
[{"$nulls":4},0,0,0]
[{"$nulls":4},0,0,0]
[{"$nulls":4},0,0,0]
[{"$nulls":4},0,0,0]
[{"$nulls":4},0,0,0]
[{"$nulls":4},0,0,0]
[{"$nulls":4},0,0,0]
[{"$nulls":4},0,0,0]
[{"$nulls":4},0,0,0]
[{"$nulls":4},0,0,0]
[{"$nulls":4},0,0,0]
[{"$nulls":4},0,0,0]
[{"$nulls":4},0,0,0]
[{"$nulls":4},0,0,0]
[{"$nulls":4},0,0,0]
[{"$nulls":4},0,0,0]
[{"$nulls":4},0,0,0]
[{"$nulls":4},0,0,0]
[{"$nulls":4},0,0,0]
[{"$nulls":4},0,0,0]
[{"$nulls":4},0,0,0]
[{"$nulls":4},0,0,0]
[{"$nulls":4},0,0,0]
[{"$nulls":4},0,0,0]
[{"$nulls":4},0,0,0]
[{"$nulls":4},0,0,0]
[{"$nulls":4},0,0,0]
[{"$nulls":4},0,0,0]
[{"$nulls":4},0,0,0]
[{"$nulls":4},0,0,0]
[{"$nulls":4},0,0,0]
[{"$nulls":4},0,0,0]
[{"$nulls":4},0,0,0]
[{"$nulls":4},0,0,0]
[{"$nulls":4},0,0,0]
[{"$nulls":4},0,0,0]
[{"$nulls":4},0,0,0]
[{"$nulls":4},0,0,0]
[{"$nulls":4},0,0,0]
[{"$nulls":4},0,0,0]
[{"$nulls":4},0,0,0]
[{"$nulls":4},0,0,0]
[{"$nulls":4},0,0,0]
[{"$nulls":4},0,0,0]
[{"$nulls":4},0,0,0]
[{"$nulls":4},0,0,0]
[{"$nulls":4},0,0,0]
[{"$nulls":4},0,0,0]
[{"$nulls":4},0,0,0]
[{"$nulls":4},0,0,0]
[{"$nulls":4},0,0,0]
[{"$nulls":4},0,0,0]
[{"$nulls":4},0,0,0]
[{"$nulls":4},0,0,0]
[{"$nulls":4},0,0,0]
[{"$nulls":4},0,0,0]
[{"$nulls":4},0,0,0]
[{"$nulls":4},0,0,0]
[{"$nulls":4},0,0,0]
[{"$nulls":4},0,0,0]
[{"$nulls":4},0,0,0]
[{"$nulls":4},0,0,0]
[{"$nulls":4},0,0,0]
[{"$nulls":4},0,0,0]
[{"$nulls":4},0,0,0]
[{"$nulls":4},0,0,0]
[{"$nulls":4},0,0,0]
[{"$nulls":4},0,0,0]
[{"$nulls":4},0,0,0]
[{"$nulls":4},0,0,0]
[{"$nulls":4},0,0,0]
[{"$nulls":4},0,0,0]

{"sheet":"prospetto 4.1","index":5,"n_rows":33,"n_cols":26,"rows_kept":33,"merged":[[1,6,1,7],[2,6,2,7],[10,2,10,5],[11,2,11,5],[12,2,12,5],[13,2,13,5],[14,2,14,5],[17,1,17,5],[19,1,19,5],[20,1,20,5],[21,1,21,5],[22,1,22,5],[24,1,24,5],[27,1,27,5],[32,1,32,3]]}
[null," ",{"$nulls":6},"Prospetto 4.1"]
[null,"Impresa",null,{"$f":"IF(ISERROR('Foglio Informativo'!C4),\"\",'Foglio Informativo'!C4)","v":" << Fare click per selezionare la compagnia >> "},null,null,{"$f":"IF('Foglio Informativo'!J4 = 0,\"\",'Foglio Informativo'!J4)","v":"   "},{"$f":"IF('Foglio Informativo'!G4 = 0,\"\",'Foglio Informativo'!G4)","v":""},{"$nulls":17},"Esercizio .................... "]
[{"$nulls":3},"(denominazione)",null,null,"(codice)"]
["CONTO ECONOMICO - RAMI DANNI"]
[{"$nulls":3},"Esercizio",null,{"$f":"'Foglio Informativo'!D6","v":"2019"}]
[]
[{"$nulls":8},"(valori in migliaia di Euro)"]
[]
[]
[]
[null,null,"Premi di competenza (Conto economico voce 5)",{"$nulls":3},"+",1,0]
[null,null,"Quota dell'utile degli investimenti trasferita dal conto non tecnico (Conto economico voce 6)",{"$nulls":3},"+",{"$f":"H11+1","v":2},0]
[null,null,"Altre partite tecniche (Conto economico voci  7 - 19 - 27) (+ o -)",{"$nulls":3},"+",3,0]
[null,null,"Oneri relativi ai sinistri (Conto economico voce 17)",{"$nulls":3},"-",4,0]
[null,null,"Variazione delle altre riserve tecniche (Conto economico voce 18) ",{"$nulls":3},"-",5,0]
[null,null,"Spese di gestione (Conto economico voce 26)",{"$nulls":3},"-",6,0]
[null,null,"Variazione delle riserve di perequazione (Conto economico voce 28) ",{"$nulls":3},"-",7,0]
[null,"RISULTATO DEL CONTO TECNICO (*) (**) (Conto economico voce 29) (+ o -)",{"$nulls":5},8,{"$f":"I11+I12+I13-I14-I15-I16-I17","v":0}]
[]
[null,"Proventi da investimenti al netto degli oneri (Allegato 3 voci 2 - 3) (+ o -)",{"$nulls":4},"+",{"$f":"H18+1","v":9},0]
[null,"Quota dell'utile degli investimenti trasferita al conto tecnico (Allegato 3 voce 5)",{"$nulls":4},"-",{"$f":"H20+1","v":10},0]
[null,"Altri proventi al netto degli oneri (Allegato 3 voci 7 - 8) (+ o -)",{"$nulls":4},"+",{"$f":"H21+1","v":11},0]
[null,"RISULTATO DELLA ATTIVITA' ORDINARIA (+ o -)",{"$nulls":5},{"$f":"H22+1","v":12},{"$f":"I18+I20-I21+I22","v":0}]
[]
[null,"Proventi straordinari al netto degli oneri (Allegato 3 voci 9 - 10) (+ o -)",{"$nulls":4},"+",{"$f":"H23+1","v":13},0]
[null,"Imposte sul reddito dell'esercizio (Allegato 3 voce 12)",{"$nulls":4},"-",{"$f":"H25+1","v":14},0]
[]
[null,"UTILE (PERDITA) D'ESERCIZIO (Allegato 3 voce 13) (+ o -)",{"$nulls":5},{"$f":"H26+1","v":15},0]
[]
[]
[null,"(*)    Deve coincidere con la voce 1 dell'Allegato 3"]
[]
[null,"(**) di cui: Risultato del conto tecnico del lavoro ceduto - portafoglio diretto italiano (Allegato 26 voce 20)     ",null,null,{"$f":"H28+1","v":16},0]

{"sheet":"prospetto 4.2","index":6,"n_rows":43,"n_cols":26,"rows_kept":43,"merged":[[1,5,1,7],[2,6,2,7],[14,2,14,4],[17,2,17,4],[18,2,18,4],[20,2,20,4],[21,1,21,5],[25,1,25,5],[27,1,27,4],[30,1,30,5]]}
[{"$nulls":8},"Prospetto 4.2"]
[null,"Impresa",null,{"$f":"IF(ISERROR('Foglio Informativo'!C4),\"\",'Foglio Informativo'!C4)","v":" << Fare click per selezionare la compagnia >> "},null,{"$f":"IF('Foglio Informativo'!J4 = 0,\"\",'Foglio Informativo'!J4)","v":"   "},"='Foglio Informativo'!D6","='Foglio Informativo'!D6",{"$nulls":17},"Esercizio .................... "]
[{"$nulls":3},"(denominazione)",null,null,"(codice)"]
["CONTO ECONOMICO - RAMI VITA"]
[{"$nulls":3},"Esercizio",{"$f":"'Foglio Informativo'!D6","v":"2019"}]
[]
[{"$nulls":8},"(valori in migliaia di Euro)"]
[]
[]
[]
[null,null,"Premi dell'esercizio (Conto economico voce 32)",{"$nulls":3},"+",1,0]
[null,null,"Proventi da investimenti (Conto economico voce 42)",{"$nulls":3},"+",17,0]
[null,null,"Oneri patrimoniali e finanziari (Conto economico voce 76) (*)",{"$nulls":3},"-",{"$f":"H12+1","v":18},0]
[null,null,"Proventi e plusvalenze non realizzate relativi a investimenti a beneficio di assicurati"]
[null,null,"i quali ne sopportano il rischio e a investimenti derivanti dalla gestione dei fondi pensione al netto degli oneri e delle minusvalenze non realizzate (Conto economico voci 43 - 77) (+ o -)",{"$nulls":3},"+",3,0]
[null,null,"Altre partite tecniche (Conto economico voci 44 - 65 - 78) (+ o -) ",{"$nulls":3},"+",{"$f":"H15+1","v":4},0]
[null,null,"Oneri relativi ai sinistri (Conto economico voce 51) (**)",{"$nulls":3},"-",5,0]
[null,null,"Variazione delle riserve matematiche e delle altre riserve tecniche - classe C                                                            (Conto economico voci 54 + 57 + 60) ",{"$nulls":3},"-",6,0]
[null,null,"Variazione delle riserve tecniche - classe D (Conto economico voce 63) ",{"$nulls":3},"-",7,0]
[null,null,"Spese di gestione (Conto economico voce 72)",{"$nulls":3},"-",8,0]
[null,null,"Quota dell'utile degli investimenti trasferita al conto non tecnico (Conto economico voce 79)",{"$nulls":3},"-",9,0]
[null,"RISULTATO DEL CONTO TECNICO (***) (Conto economico voce 80) (+ o -)",{"$nulls":5},10,{"$f":"I11+I12+I15+I16-I13-I17-I18-I19-I20-I21","v":0}]
[]
[null,"Quota dell'utile degli investimenti trasferita dal conto tecnico (Allegato 3 voce 24)",{"$nulls":4},"+",{"$f":"H22+1","v":11},0]
[null,"Altri proventi al netto degli oneri (Allegato 3 voci 27 - 28) (+ o -)",{"$nulls":4},"+",{"$f":"H24+1","v":12},0]
[null,"RISULTATO DELLA ATTIVITA' ORDINARIA",{"$nulls":5},{"$f":"H25+1","v":13},{"$f":"I22+I24+I25","v":0}]
[]
[null,"Proventi straordinari al netto degli oneri (Allegato 3 voci 29 - 30) (+ o -)",{"$nulls":4},"+",{"$f":"H26+1","v":14},0]
[null,"Imposte sul reddito dell'esercizio (Allegato 3 voce 32)",{"$nulls":4},"-",{"$f":"H28+1","v":15},0]
[]
[null,"UTILE (PERDITA) D'ESERCIZIO (Allegato 3 voce 33) (+ o -)",{"$nulls":5},{"$f":"H29+1","v":16},0]
[]
[]
[null,"(*)    di cui: ",null,"  Rettifiche di valore sugli investimenti (Conto economico voce 74)     ",{"$f":"H13+1","v":19},0]
[]
[]
[null,"(**)  di cui: ",null,"-  Oneri relativi ai sinistri - portafoglio diretto italiano (voce 22 Modulo 21)",{"$f":"E34+1","v":20},0]
[]
[{"$nulls":3}," - Riscatti - portafoglio diretto italiano (voci 13 + 18 - 7 Modulo 21)",{"$f":"E37+1","v":21},0]
[]
[{"$nulls":3}," - Capitali e rendite maturati - portafoglio diretto italiano (voci 12 + 17 - 6  Modulo 21)  ",{"$f":"E39+1","v":22},0]
[]
[null,"(***) Deve coincidere con la voce 21 dell'Allegato 3"]

{"sheet":"prospetto 5","index":7,"n_rows":66,"n_cols":36,"rows_kept":66,"merged":[[1,3,1,5],[1,28,1,29],[6,6,6,9],[6,10,6,13],[6,14,6,17],[6,18,6,21],[6,22,6,25],[6,26,6,29],[9,7,9,8],[9,11,9,12],[9,15,9,16],[9,19,9,20],[9,23,9,24],[9,27,9,28],[10,7,10,8],[10,11,10,12],[10,15,10,16],[10,19,10,20],[10,23,10,24],[10,27,10,28],[11,7,11,8],[11,11,11,12],[11,15,11,16],[11,19,11,20],[11,23,11,24],[11,27,11,28],[12,7,12,8],[12,11,12,12],[12,15,12,16],[12,19,12,20],[12,23,12,24],[12,27,12,28],[13,7,13,8],[13,11,13,12],[13,15,13,16],[13,19,13,20],[13,23,13,24],[13,27,13,28],[14,7,14,8],[14,11,14,12],[14,15,14,16],[14,19,14,20],[14,23,14,24],[14,27,14,28],[15,7,15,8],[15,11,15,12],[15,15,15,16],[15,19,15,20],[15,23,15,24],[15,27,15,28],[16,7,16,8],[16,11,16,12],[16,15,16,16],[16,19,16,20],[16,23,16,24],[16,27,16,28],[17,7,17,8],[17,11,17,12],[17,15,17,16],[17,19,17,20],[17,23,17,24],[17,27,17,28],[18,7,18,8],[18,11,18,12],[18,15,18,16],[18,19,18,20],[18,23,18,24],[18,27,18,28],[19,7,19,8],[19,11,19,12],[19,15,19,16],[19,19,19,20],[19,23,19,24],[19,27,19,28],[20,7,20,8],[20,11,20,12],[20,15,20,16],[20,19,20,20],[20,23,20,24],[20,27,20,28],[21,7,21,8],[21,11,21,12],[21,15,21,16],[21,19,21,20],[21,23,21,24],[21,27,21,28],[22,7,22,8],[22,11,22,12],[22,15,22,16],[22,19,22,20],[22,23,22,24],[22,27,22,28],[26,6,26,9],[26,10,26,13],[26,14,26,17],[26,18,26,21],[26,22,26,25],[26,26,26,29],[29,7,29,8],[29,11,29,12],[29,15,29,16],[29,19,29,20],[29,23,29,24],[29,27,29,28],[30,7,30,8],[30,11,30,12],[30,15,30,16],[30,19,30,20],[30,23,30,24],[30,27,30,28],[31,7,31,8],[31,11,31,12],[31,15,31,16],[31,19,31,20],[31,23,31,24],[31,27,31,28],[32,7,32,8],[32,11,32,12],[32,15,32,16],[32,19,32,20],[32,23,32,24],[32,27,32,28],[33,7,33,8],[33,11,33,12],[33,15,33,16],[33,19,33,20],[33,23,33,24],[33,27,33,28],[34,7,34,8],[34,11,34,12],[34,15,34,16],[34,19,34,20],[34,23,34,24],[34,27,34,28],[35,7,35,8],[35,11,35,12],[35,15,35,16],[35,19,35,20],[35,23,35,24],[35,27,35,28],[36,7,36,8],[36,11,36,12],[36,15,36,16],[36,19,36,20],[36,23,36,24],[36,27,36,28],[37,7,37,8],[37,11,37,12],[37,15,37,16],[37,19,37,20],[37,23,37,24],[37,27,37,28],[38,7,38,8],[38,11,38,12],[38,15,38,16],[38,19,38,20],[38,23,38,24],[38,27,38,28],[39,7,39,8],[39,11,39,12],[39,15,39,16],[39,19,39,20],[39,23,39,24],[39,27,39,28],[40,7,40,8],[40,11,40,12],[40,15,40,16],[40,19,40,20],[40,23,40,24],[40,27,40,28],[41,7,41,8],[41,11,41,12],[41,15,41,16],[41,19,41,20],[41,23,41,24],[41,27,41,28],[42,7,42,8],[42,11,42,12],[42,15,42,16],[42,19,42,20],[42,23,42,24],[42,27,42,28],[43,7,43,8],[46,6,46,9],[46,10,46,13],[46,14,46,17],[46,18,46,21],[46,22,46,25],[46,26,46,29],[49,7,49,8],[49,11,49,12],[49,15,49,16],[49,19,49,20],[49,23,49,24],[49,27,49,28],[50,7,50,8],[50,11,50,12],[50,15,50,16],[50,19,50,20],[50,23,50,24],[50,27,50,28],[51,7,51,8],[51,11,51,12],[51,15,51,16],[51,19,51,20],[51,23,51,24],[51,27,51,28],[52,7,52,8],[52,11,52,12],[52,15,52,16],[52,19,52,20],[52,23,52,24],[52,27,52,28],[53,7,53,8],[53,11,53,12],[53,15,53,16],[53,19,53,20],[53,23,53,24],[53,27,53,28],[54,7,54,8],[54,11,54,12],[54,15,54,16],[54,19,54,20],[54,23,54,24],[54,27,54,28],[55,7,55,8],[55,11,55,12],[55,15,55,16],[55,19,55,20],[55,23,55,24],[55,27,55,28],[56,7,56,8],[56,11,56,12],[56,15,56,16],[56,19,56,20],[56,23,56,24],[56,27,56,28],[57,7,57,8],[57,11,57,12],[57,15,57,16],[57,19,57,20],[57,23,57,24],[57,27,57,28],[58,7,58,8],[58,11,58,12],[58,15,58,16],[58,19,58,20],[58,23,58,24],[58,27,58,28],[59,7,59,8],[59,11,59,12],[59,15,59,16],[59,19,59,20],[59,23,59,24],[59,27,59,28],[60,7,60,8],[60,11,60,12],[60,15,60,16],[60,19,60,20],[60,23,60,24],[60,27,60,28],[61,7,61,8],[61,11,61,12],[61,15,61,16],[61,19,61,20],[61,23,61,24],[61,27,61,28],[62,7,62,8],[62,11,62,12],[62,15,62,16],[62,19,62,20],[62,23,62,24],[62,27,62,28]]}
[{"$nulls":28},"Prospetto 5",{"$nulls":5},0,{"$f":"\"\"","v":""}]
["Impresa",null,null,{"$f":"IF(ISERROR('Foglio Informativo'!C4),\"\",'Foglio Informativo'!C4)","v":" << Fare click per selezionare la compagnia >> "},{"$f":"IF(ISERROR('Foglio Informativo'!D4),\"\",'Foglio Informativo'!D4)","v":0},{"$f":"IF(ISERROR('Foglio Informativo'!E4),\"\",'Foglio Informativo'!E4)","v":0},null,null,{"$f":"IF('Foglio Informativo'!J4 = 0,\"\",'Foglio Informativo'!J4)","v":"   "},{"$nulls":18},"Esercizio",{"$f":"'Foglio Informativo'!D6","v":"2019"},{"$f":"'Foglio Informativo'!AC3","v":0},{"$nulls":4},1,"Infortuni"]
[{"$nulls":3},"(denominazione)",{"$nulls":4},"(codice)",{"$nulls":25},2,"Malattie"]
[{"$nulls":13},"Assicurazioni danni - Prospetto di sintesi dei conti tecnici per ","singolo ramo - Portafoglio italiano (Valori in migliaia di Euro)",{"$nulls":19},3,"Corpi di veicoli terrestri"]
[{"$nulls":34},4,"Corpi di veicoli ferroviari"]
[{"$nulls":6}," Codice ramo",null,1,null," Codice ramo",null,2,null," Codice ramo",null,3,null," Codice ramo",null,4,null," Codice ramo",null,5,null," Codice ramo",null,6,{"$nulls":5},5,"Corpi di veicoli aerei"]
[{"$nulls":6},{"$f":"VLOOKUP(I6,$AI$1:$AJ$20,2,FALSE)","v":"Infortuni"},{"$nulls":3},{"$f":"VLOOKUP(M6,$AI$1:$AJ$20,2,FALSE)","v":"Malattie"},{"$nulls":3},{"$f":"VLOOKUP(Q6,$AI$1:$AJ$20,2,FALSE)","v":"Corpi di veicoli terrestri"},{"$nulls":3},{"$f":"VLOOKUP(U6,$AI$1:$AJ$20,2,FALSE)","v":"Corpi di veicoli ferroviari"},{"$nulls":3},{"$f":"VLOOKUP(Y6,$AI$1:$AJ$20,2,FALSE)","v":"Corpi di veicoli aerei"},{"$nulls":3},{"$f":"VLOOKUP(AC6,$AI$1:$AJ$20,2,FALSE)","v":"Corpi di veicoli marittimi"},{"$nulls":7},6,"Corpi di veicoli marittimi"]
[{"$nulls":6},"(denominazione)",{"$nulls":3},"(denominazione)",{"$nulls":3},"(denominazione)",{"$nulls":3},"(denominazione)",{"$nulls":3},"(denominazione)",{"$nulls":3},"(denominazione)",{"$nulls":7},7,"Merci trasportate"]
[null,"Lavoro diretto al lordo delle cessioni in riassicurazione",{"$nulls":32},8,"Incendio ed elementi naturali"]
[null,null,"Premi contabilizzati ...................................................................................................................",null,null,"+",{"$f":"1","v":1},0,null,null,{"$f":"1","v":1},0,null,null,{"$f":"1","v":1},0,null,null,{"$f":"1","v":1},0,null,null,{"$f":"1","v":1},0,null,null,{"$f":"1","v":1},0,{"$nulls":6},9,"Altri danni ai beni"]
[null,null,"di cui: premi ceduti .........................................................................…",{"$nulls":3},32,0,null,null,32,0,null,null,32,0,null,null,32,0,null,null,32,0,null,null,32,0]
[null,null,"Variazione della riserva premi (+ o -) .........................................................................................................................",null,null,"-",{"$f":"G10+1","v":2},0,null,null,{"$f":"K10+1","v":2},0,null,null,{"$f":"O10+1","v":2},0,null,null,{"$f":"S10+1","v":2},0,null,null,{"$f":"W10+1","v":2},0,null,null,{"$f":"AA10+1","v":2},0,{"$nulls":6},10,"R.C. autoveicoli terrestri"]
[null,null,"Oneri relativi ai sinistri ............................................................................................................",null,null,"-",{"$f":"G12+1","v":3},0,null,null,{"$f":"K12+1","v":3},0,null,null,{"$f":"O12+1","v":3},0,null,null,{"$f":"S12+1","v":3},0,null,null,{"$f":"W12+1","v":3},0,null,null,{"$f":"AA12+1","v":3},0,{"$nulls":6},11,"R.C. aereomobili"]
[null,null,"di cui: sinistri dell'esercizio .........................................................................................................…",null,null," ",31,0,null,null,31,0,null,null,31,0,null,null,31,0,null,null,31,0,null,null,31,0,{"$nulls":6},12,"R.C. veicoli marittimi"]
[null,null,"Variazione delle riserve tecniche diverse (+ o -) (1)  ...................................................................................................................................................................",null,null,"-",{"$f":"G13+1","v":4},0,null,null,{"$f":"K13+1","v":4},0,null,null,{"$f":"O13+1","v":4},0,null,null,{"$f":"S13+1","v":4},0,null,null,{"$f":"W13+1","v":4},0,null,null,{"$f":"AA13+1","v":4},0,{"$nulls":6},13,"R.C. generale"]
[null,null,"Saldo delle altre partite tecniche (+ o -) ..................................................................................................................",null,null,"+",{"$f":"G15+1","v":5},0,null,null,{"$f":"K15+1","v":5},0,null,null,{"$f":"O15+1","v":5},0,null,null,{"$f":"S15+1","v":5},0,null,null,{"$f":"W15+1","v":5},0,null,null,{"$f":"AA15+1","v":5},0,{"$nulls":6},14,"Credito"]
[null,null,"Spese di gestione ................................................................................................................",null,null,"-",{"$f":"G16+1","v":6},0,null,null,{"$f":"K16+1","v":6},0,null,null,6,0,null,null,6,0,null,null,6,0,null,null,6,0,{"$nulls":6},15,"Cauzione"]
[null,"Saldo tecnico del lavoro diretto (+ o -) .........................................................................................................",null,null," A "," ",{"$f":"G17+1","v":7},{"$f":"H10-H12-H13-H15+H16-H17","v":0},null,null,{"$f":"K17+1","v":7},{"$f":"L10-L12-L13-L15+L16-L17","v":0},null,null,7,{"$f":"P10-P12-P13-P15+P16-P17","v":0},null,null,7,{"$f":"T10-T12-T13-T15+T16-T17","v":0},null,null,7,{"$f":"X10-X12-X13-X15+X16-X17","v":0},null,null,7,{"$f":"AB10-AB12-AB13-AB15+AB16-AB17","v":0},{"$nulls":6},16,"Perdite pecunarie"]
[null,"Risultato della riassicurazione passiva (+ o -) ...........................................................................",null,null," B "," ",8,0,null,null,8,0,null,null,8,0,null,null,8,0,null,null,8,0,null,null,8,0,{"$nulls":6},17,"Tutela legale"]
[null,"Risultato netto del lavoro indiretto (+ o -) ...........................................................................",null,null," C "," ",9,0,null,null,9,0,null,null,9,0,null,null,9,0,null,null,9,0,null,null,9,0,{"$nulls":6},18,"Assistenza"]
[null,null,"Variazione delle riserve di perequazione (+ o -) .........................................................",null," D "," ",10,0,null,null,10,0,null,null,10,0,null,null,10,0,null,null,10,0,null,null,10,0]
[null,null,"Quota dell'utile degli investimenti trasferita dal conto non tecnico ........................................",null," E "," ",11,0,null,null,11,0,null,null,11,0,null,null,11,0,null,null,11,0,null,null,11,0]
[null,"Risultato del conto tecnico (+ o -) ..........................  (A + B + C - D + E)",{"$nulls":3}," ",12,0,null,null,12,0,null,null,12,0,null,null,12,0,null,null,12,0,null,null,12,0]
[{"$nulls":5}," "]
[]
[{"$nulls":6}," Codice ramo",null,7,null," Codice ramo",null,8,null," Codice ramo",null,9,null," Codice ramo",null,10,null," Codice ramo",null,11,null," Codice ramo",null,12]
[{"$nulls":6},{"$f":"VLOOKUP(I26,$AI$1:$AJ$20,2,FALSE)","v":"Merci trasportate"},{"$nulls":3},{"$f":"VLOOKUP(M26,$AI$1:$AJ$20,2,FALSE)","v":"Incendio ed elementi naturali"},{"$nulls":3},{"$f":"VLOOKUP(Q26,$AI$1:$AJ$20,2,FALSE)","v":"Altri danni ai beni"},{"$nulls":3},{"$f":"VLOOKUP(U26,$AI$1:$AJ$20,2,FALSE)","v":"R.C. autoveicoli terrestri"},{"$nulls":3},{"$f":"VLOOKUP(Y26,$AI$1:$AJ$20,2,FALSE)","v":"R.C. aereomobili"},{"$nulls":3},{"$f":"VLOOKUP(AC26,$AI$1:$AJ$20,2,FALSE)","v":"R.C. veicoli marittimi"}]
[{"$nulls":6},"(denominazione)",{"$nulls":3},"(denominazione)",{"$nulls":3},"(denominazione)",{"$nulls":3},"(denominazione)",{"$nulls":3},"(denominazione)",{"$nulls":3},"(denominazione)"]
[null,"Lavoro diretto al lordo delle cessioni in riassicurazione"]
[null,null,"Premi contabilizzati ...................................................................................................................",null,null,"+",{"$f":"1","v":1},0,null,null,{"$f":"1","v":1},0,null,null,{"$f":"1","v":1},0,null,null,{"$f":"1","v":1},0,null,null,{"$f":"1","v":1},0,null,null,{"$f":"1","v":1},0]
[null,null,"di cui: premi ceduti .........................................................................…",{"$nulls":3},32,0,null,null,32,0,null,null,32,0,null,null,32,0,null,null,32,0,null,null,32,0]
[null,null,"Variazione della riserva premi (+ o -) .........................................................................................................................",null,null,"-",{"$f":"G30+1","v":2},0,null,null,{"$f":"K30+1","v":2},0,null,null,{"$f":"O30+1","v":2},0,null,null,{"$f":"S30+1","v":2},0,null,null,{"$f":"W30+1","v":2},0,null,null,{"$f":"AA30+1","v":2},0]
[null,null,"Oneri relativi ai sinistri ............................................................................................................",null,null,"-",{"$f":"G32+1","v":3},0,null,null,{"$f":"K32+1","v":3},0,null,null,{"$f":"O32+1","v":3},0,null,null,{"$f":"S32+1","v":3},0,null,null,{"$f":"W32+1","v":3},0,null,null,{"$f":"AA32+1","v":3},0]
[null,null,"di cui: sinistri dell'esercizio .........................................................................................................…",null,null," ",31,0,null,null,31,0,null,null,31,0,null,null,31,0,null,null,31,0,null,null,31,0]
[null,null,"Variazione delle riserve tecniche diverse (+ o -) (1)  ...................................................................................................................................................................",null,null,"-",{"$f":"G33+1","v":4},0,null,null,{"$f":"K33+1","v":4},0,null,null,{"$f":"O33+1","v":4},0,null,null,{"$f":"S33+1","v":4},0,null,null,{"$f":"W33+1","v":4},0,null,null,{"$f":"AA33+1","v":4},0]
[null,null,"Saldo delle altre partite tecniche (+ o -) ..................................................................................................................",null,null,"+",{"$f":"G35+1","v":5},0,null,null,{"$f":"K35+1","v":5},0,null,null,{"$f":"O35+1","v":5},0,null,null,{"$f":"S35+1","v":5},0,null,null,{"$f":"W35+1","v":5},0,null,null,{"$f":"AA35+1","v":5},0]
[null,null,"Spese di gestione ................................................................................................................",null,null,"-",6,0,null,null,6,0,null,null,6,0,null,null,6,0,null,null,6,0,null,null,6,0]
[null,"Saldo tecnico del lavoro diretto (+ o -) .........................................................................................................",null,null," A "," ",7,{"$f":"H30-H32-H33-H35+H36-H37","v":0},null,null,7,{"$f":"L30-L32-L33-L35+L36-L37","v":0},null,null,7,{"$f":"P30-P32-P33-P35+P36-P37","v":0},null,null,7,{"$f":"T30-T32-T33-T35+T36-T37","v":0},null,null,7,{"$f":"X30-X32-X33-X35+X36-X37","v":0},null,null,7,{"$f":"AB30-AB32-AB33-AB35+AB36-AB37","v":0}]
[null,"Risultato della riassicurazione passiva (+ o -) ...........................................................................",null,null," B "," ",8,0,null,null,8,0,null,null,8,0,null,null,8,0,null,null,8,0,null,null,8,0]
[null,"Risultato netto del lavoro indiretto (+ o -) ...........................................................................",null,null," C "," ",9,0,null,null,9,0,null,null,9,0,null,null,9,0,null,null,9,0,null,null,9,0]
[null,null,"Variazione delle riserve di perequazione (+ o -) .........................................................",null," D "," ",10,0,null,null,10,0,null,null,10,0,null,null,10,0,null,null,10,0,null,null,10,0]
[null,null,"Quota dell'utile degli investimenti trasferita dal conto non tecnico ........................................",null," E "," ",11,0,null,null,11,0,null,null,11,0,null,null,11,0,null,null,11,0,null,null,11,0]
[null,"Risultato del conto tecnico (+ o -) ..........................  (A + B + C - D + E)",{"$nulls":3}," ",12,0,null,null,12,0,null,null,12,0,null,null,12,0,null,null,12,0,null,null,12,0]
[{"$nulls":5}," "]
[]
[{"$nulls":6}," Codice ramo",null,13,null," Codice ramo",null,14,null," Codice ramo",null,15,null," Codice ramo",null,16,null," Codice ramo",null,17,null," Codice ramo",null,18]
[{"$nulls":6},{"$f":"VLOOKUP(I46,$AI$1:$AJ$20,2,FALSE)","v":"R.C. generale"},{"$nulls":3},{"$f":"VLOOKUP(M46,$AI$1:$AJ$20,2,FALSE)","v":"Credito"},{"$nulls":3},{"$f":"VLOOKUP(Q46,$AI$1:$AJ$20,2,FALSE)","v":"Cauzione"},{"$nulls":3},{"$f":"VLOOKUP(U46,$AI$1:$AJ$20,2,FALSE)","v":"Perdite pecunarie"},{"$nulls":3},{"$f":"VLOOKUP(Y46,$AI$1:$AJ$20,2,FALSE)","v":"Tutela legale"},{"$nulls":3},{"$f":"VLOOKUP(AC46,$AI$1:$AJ$20,2,FALSE)","v":"Assistenza"}]
[{"$nulls":6},"(denominazione)",{"$nulls":3},"(denominazione)",{"$nulls":3},"(denominazione)",{"$nulls":3},"(denominazione)",{"$nulls":3},"(denominazione)",{"$nulls":3},"(denominazione)"]
[null,"Lavoro diretto al lordo delle cessioni in riassicurazione"]
[null,null,"Premi contabilizzati ...................................................................................................................",null,null,"+",{"$f":"1","v":1},0,null,null,{"$f":"1","v":1},0,null,null,{"$f":"1","v":1},0,null,null,{"$f":"1","v":1},0,null,null,{"$f":"1","v":1},0,null,null,{"$f":"1","v":1},0]
[null,null,"di cui: premi ceduti .........................................................................…",{"$nulls":3},32,0,null,null,32,0,null,null,32,0,null,null,32,0,null,null,32,0,null,null,32,0]
[null,null,"Variazione della riserva premi (+ o -) .........................................................................................................................",null,null,"-",{"$f":"G50+1","v":2},0,null,null,{"$f":"K50+1","v":2},0,null,null,{"$f":"O50+1","v":2},0,null,null,{"$f":"S50+1","v":2},0,null,null,{"$f":"W50+1","v":2},0,null,null,{"$f":"AA50+1","v":2},0]
[null,null,"Oneri relativi ai sinistri ............................................................................................................",null,null,"-",{"$f":"G52+1","v":3},0,null,null,{"$f":"K52+1","v":3},0,null,null,{"$f":"O52+1","v":3},0,null,null,{"$f":"S52+1","v":3},0,null,null,{"$f":"W52+1","v":3},0,null,null,{"$f":"AA52+1","v":3},0]
[null,null,"di cui: sinistri dell'esercizio .........................................................................................................…",null,null," ",31,0,null,null,31,0,null,null,31,0,null,null,31,0,null,null,31,0,null,null,31,0]
[null,null,"Variazione delle riserve tecniche diverse (+ o -) (1)  ...................................................................................................................................................................",null,null,"-",{"$f":"G53+1","v":4},0,null,null,{"$f":"K53+1","v":4},0,null,null,{"$f":"O53+1","v":4},0,null,null,{"$f":"S53+1","v":4},0,null,null,{"$f":"W53+1","v":4},0,null,null,{"$f":"AA53+1","v":4},0]
[null,null,"Saldo delle altre partite tecniche (+ o -) ..................................................................................................................",null,null,"+",{"$f":"G55+1","v":5},0,null,null,{"$f":"K55+1","v":5},0,null,null,{"$f":"O55+1","v":5},0,null,null,{"$f":"S55+1","v":5},0,null,null,{"$f":"W55+1","v":5},0,null,null,{"$f":"AA55+1","v":5},0]
[null,null,"Spese di gestione ................................................................................................................",null,null,"-",6,0,null,null,6,0,null,null,6,0,null,null,6,0,null,null,6,0,null,null,6,0]
[null,"Saldo tecnico del lavoro diretto (+ o -) .........................................................................................................",null,null," A "," ",7,{"$f":"H50-H52-H53-H55+H56-H57","v":0},null,null,7,{"$f":"L50-L52-L53-L55+L56-L57","v":0},null,null,7,{"$f":"P50-P52-P53-P55+P56-P57","v":0},null,null,7,{"$f":"T50-T52-T53-T55+T56-T57","v":0},null,null,7,{"$f":"X50-X52-X53-X55+X56-X57","v":0},null,null,7,{"$f":"AB50-AB52-AB53-AB55+AB56-AB57","v":0}]
[null,"Risultato della riassicurazione passiva (+ o -) ...........................................................................",null,null," B "," ",8,0,null,null,8,0,null,null,8,0,null,null,8,0,null,null,8,0,null,null,8,0]
[null,"Risultato netto del lavoro indiretto (+ o -) ...........................................................................",null,null," C "," ",9,0,null,null,9,0,null,null,9,0,null,null,9,0,null,null,9,0,null,null,9,0]
[null,null,"Variazione delle riserve di perequazione (+ o -) .........................................................",null," D "," ",10,0,null,null,10,0,null,null,10,0,null,null,10,0,null,null,10,0,null,null,10,0]
[null,null,"Quota dell'utile degli investimenti trasferita dal conto non tecnico ........................................",null," E "," ",11,0,null,null,11,0,null,null,11,0,null,null,11,0,null,null,11,0,null,null,11,0]
[null,"Risultato del conto tecnico (+ o -) ..........................  (A + B + C - D + E)",{"$nulls":3}," ",12,0,null,null,12,0,null,null,12,0,null,null,12,0,null,null,12,0,null,null,12,0]
[{"$nulls":5}," "]
[]
["(1) Tale voce comprende oltre alla variazione delle \"Altre riserve tecniche\" anche la variazione della \"Riserva per partecipazione agli utili e ristorni\""]

{"sheet":"prospetto 5.1","index":8,"n_rows":57,"n_cols":29,"rows_kept":57,"merged":[[9,1,9,10],[9,11,9,28],[10,1,11,4],[10,5,11,8],[10,9,11,10],[10,12,10,18],[10,19,10,26],[10,27,10,28],[11,12,11,14],[11,15,11,18],[11,19,11,22],[11,23,11,26],[11,27,11,28],[12,1,12,2],[12,5,12,6],[12,7,12,8],[12,9,12,10],[12,11,12,12],[12,13,12,14],[12,19,12,20],[12,21,12,22],[12,23,12,24],[12,25,12,26],[12,27,12,28],[23,0,23,20]]}
[" ",{"$nulls":27},"Prospetto 5.1 (rami 10+12)"]
["Impresa ",null,{"$f":"IF(ISERROR('Foglio Informativo'!C4),\"\",'Foglio Informativo'!C4)","v":" << Fare click per selezionare la compagnia >> "},{"$nulls":25},{"$f":"IF('Foglio Informativo'!J4 = 0,\"\",'Foglio Informativo'!J4)","v":"   "}]
[null,null,"(denominazione)",{"$nulls":25},"(codice)"]
[]
[{"$nulls":14},"Informazioni tecniche relative ai rami 10 + 12"]
[{"$nulls":16},"Portafoglio italiano - lavoro diretto  - Esercizio  ",{"$f":"'Foglio Informativo'!D6","v":"2019"}]
[]
[]
[{"$nulls":28},"(Importi in migliaia di euro)"]
[null,"Sinistri pagati ",{"$nulls":9},"Sinistri riservati"]
[null,"Generazione N",{"$nulls":3},"Generazioni N-1 e precedenti",{"$nulls":3},"Importo",null,null,"Riserva finale al netto della stima per sinistri tardivi",{"$nulls":6},"Riserva finale stimata per sinistri tardivi"]
[{"$nulls":12},"Generazione N",null,null,"Generazioni N-1 e precedenti",{"$nulls":3},"Generazione N",{"$nulls":3},"Generazioni N-1 e precedenti",{"$nulls":3},"Importo"]
[null,"Numero",null,"   Importo (***)",null,"Numero",null,"Importo (***)",null,"totale",null,"Numero",null,"Importo",null,null,"Numero",null,"Importo","Numero",null,"Importo",null,"Numero",null,"Importo",null,"totale"]
["Sinistri No Card (*)",{"v":1,"d":" 1"},0,{"v":5,"d":" 5"},0,{"v":10,"d":" 10"},0,{"v":14,"d":" 14"},0,{"v":19,"d":" 19"},0,{"v":24,"d":" 24"},0,{"v":28,"d":" 28"},0,{"v":33,"d":" 33"},0,{"v":37,"d":" 37"},0,{"v":42,"d":" 42"},0,{"v":46,"d":" 46"},0,{"v":51,"d":" 51"},0,{"v":55,"d":" 55"},0,{"v":60,"d":" 60"},0]
["Sinistri Card (*)",{"$f":"B14+1","v":{"v":2,"d":" 2"}},0,{"$f":"D14+1","v":{"v":6,"d":" 6"}},0,{"$f":"F14+1","v":{"v":11,"d":" 11"}},0,{"$f":"H14+1","v":{"v":15,"d":" 15"}},0,{"$f":"J14+1","v":{"v":20,"d":" 20"}},0,{"$f":"L14+1","v":{"v":25,"d":" 25"}},0,{"$f":"N14+1","v":{"v":29,"d":" 29"}},0,{"$f":"P14+1","v":{"v":34,"d":" 34"}},0,{"$f":"R14+1","v":{"v":38,"d":" 38"}},0,{"$f":"T14+1","v":{"v":43,"d":" 43"}},0,{"$f":"V14+1","v":{"v":47,"d":" 47"}},0,{"$f":"X14+1","v":{"v":52,"d":" 52"}},0,{"$f":"Z14+1","v":{"v":56,"d":" 56"}},0,{"$f":"AB14+1","v":{"v":61,"d":" 61"}},0]
["Forfait gestionaria (*)",{"$f":"B15+1","v":{"v":3,"d":" 3"}},0,{"$f":"D15+1","v":{"v":7,"d":" 7"}},0,{"v":12,"d":" 12"},0,{"v":16,"d":" 16"},0,{"v":21,"d":" 21"},0,{"v":26,"d":" 26"},0,{"$f":"N15+1","v":{"v":30,"d":" 30"}},0,{"$f":"P15+1","v":{"v":35,"d":" 35"}},0,{"$f":"R15+1","v":{"v":39,"d":" 39"}},0,{"$f":"T15+1","v":{"v":44,"d":" 44"}},0,{"$f":"V15+1","v":{"v":48,"d":" 48"}},0,{"$f":"X15+1","v":{"v":53,"d":" 53"}},0,{"$f":"Z15+1","v":{"v":57,"d":" 57"}},0,{"v":62,"d":" 62"},0]
["Forfait debitrice (*)",{"$f":"B16+1","v":{"v":4,"d":" 4"}},0,{"v":8,"d":" 8"},0,{"v":13,"d":" 13"},0,{"v":17,"d":" 17"},0,{"v":22,"d":" 22"},0,{"v":27,"d":" 27"},0,{"$f":"N16+1","v":{"v":31,"d":" 31"}},0,{"$f":"P16+1","v":{"v":36,"d":" 36"}},0,{"$f":"R16+1","v":{"v":40,"d":" 40"}},0,{"$f":"T16+1","v":{"v":45,"d":" 45"}},0,{"$f":"V16+1","v":{"v":49,"d":" 49"}},0,{"$f":"X16+1","v":{"v":54,"d":" 54"}},0,{"v":58,"d":" 58"},0,{"v":63,"d":" 63"},0]
["Totale................",null,null,{"v":9,"d":" 9"},{"$f":"E14 + E15 -E16+E17","v":0},null,null,{"v":18,"d":" 18"},{"$f":"I14 + I15 -I16+I17","v":0},{"v":23,"d":" 23"},{"$f":"K14 + K15 -K16+K17","v":0},null,null,{"$f":"N17+1","v":{"v":32,"d":" 32"}},{"$f":"O14 + O15 -O16+O17","v":0},null,null,{"$f":"R17+1","v":{"v":41,"d":" 41"}},{"$f":"S14 + S15 -S16+S17","v":0},null,null,{"$f":"V17+1","v":{"v":50,"d":" 50"}},{"$f":"W14 + W15 -W16+W17","v":0},null,null,{"v":59,"d":" 59"},{"$f":"AA14 + AA15 -AA16+AA17","v":0},{"v":64,"d":" 64"},{"$f":"AC14 + AC15 -AC16+AC17","v":0}]
[]
["Sinistri gestiti (**)",{"v":65,"d":" 65"},0,{"$f":"B20+1","v":{"v":66,"d":" 66"}},0,{"$f":"D20+1","v":{"v":67,"d":" 67"}},0,{"$f":"F20+1","v":{"v":68,"d":" 68"}},0,{"$f":"H20+1","v":{"v":69,"d":" 69"}},0,{"$f":"J20+1","v":{"v":70,"d":" 70"}},0,{"$f":"L20+1","v":{"v":71,"d":" 71"}},0,{"$f":"N20+1","v":{"v":72,"d":" 72"}},0,{"$f":"P20+1","v":{"v":73,"d":" 73"}},0,{"$f":"R20+1","v":{"v":74,"d":" 74"}},0,{"$f":"T20+1","v":{"v":75,"d":" 75"}},0,{"$f":"V20+1","v":{"v":76,"d":" 76"}},0,{"$f":"X20+1","v":{"v":77,"d":" 77"}},0,{"$f":"Z20+1","v":{"v":78,"d":" 78"}},0]
[]
[]
[]
["(*)     I principi di compilazione per le quattro tipologie di gestione sono gli stessi indicati nelle istruzioni relative ai moduli 29A.1, 29A.2, 29A.3 e 29A.4."]
["          In particolare, devono essere riportati i numeri e gli importi di cui alle colonne (j), (J), (r14), (R14), (r15) ed (R15)."]
["(**)   I principi di compilazione sono gli stessi indicati nelle istruzioni relative al modulo 29B. "]
["          In particolare, devono essere riportati i numeri e gli importi di cui alle colonne (j), (J), (r14), (R14), (r15) ed (R15)."]
["(***)  L’ammontare del contributo al Fondo di Garanzia per le Vittime della Strada non deve essere compreso nell’importo dei sinistri pagati."]
[]
["voce 9 = voci (5+6-7+8)"]
["voce 18 = voci (14+15-16+17)"]
["voce 23 = voci (19+20-21+22)"]
["voce 32 = voci (28+29-30+31)"]
["voce 41 = voci (37+38-39+40)"]
["voce 50 = voci (46+47-48+49)"]
["voce 59 = voci (55+56-57+58)"]
["voce 64 = voci (60+61-62+63)"]
[]
["Ammontare del contributo al Fondo di Garanzia per le vittime della strada"]
[]
["Ramo 10",{"v":79,"d":" 79"},0,{"$nulls":7},"Ramo 12",{"$f":"B41+1","v":{"v":80,"d":" 80"}},0]
[]
[]
["N° unità di rischio dell'esercizio (N) relative a: ",{"$nulls":5},"   - polizze emesse nell'esercizio (N) [come voce 992 Modulo 29 B]",{"$nulls":13},"Rami 10+12",{"$f":"L41+1","v":{"v":81,"d":" 81"}},0]
[]
[{"$nulls":6},"   - polizze emesse negli esercizi precedenti [come voce 993 Modulo 29 B]",{"$nulls":13},"Rami 10+12",{"$f":"V44+1","v":{"v":82,"d":" 82"}},0]
[]
[]
["N° unità di rischio sinistrate almeno una volta nell'es. (N) con sinistri no card e forfait debitrice [come voce 994 Modulo 29 B] ",{"$nulls":19},"Rami 10+12",{"$f":"V46+1","v":{"v":83,"d":" 83"}},0]
[]
["N° unità di rischio sinistrate almeno una volta nell'es. (N) con sinistri card [come voce 995 Modulo 29 B] ",{"$nulls":19},"Rami 10+12",{"$f":"V49+1","v":{"v":84,"d":" 84"}},0]
[]
[]
["Saldo iniziale per diritti di gestione (voce 100 allegato 1 al modulo 29 B)",{"$nulls":10},{"v":85,"d":" 85"},0]
[]
[]
["Saldo finale per diritti di gestione (voce 101 allegato 1 al modulo 29 B)",{"$nulls":10},{"v":86,"d":" 86"},0]

{"sheet":"prospetto 5.2","index":9,"n_rows":43,"n_cols":27,"rows_kept":43,"merged":[[9,0,13,0],[9,1,9,10],[9,11,9,16],[9,17,9,22],[9,23,9,26],[10,1,12,2],[10,3,10,10],[10,11,12,12],[10,13,11,16],[10,17,12,18],[10,19,12,20],[10,21,12,22],[10,23,11,24],[10,25,12,26],[11,3,11,6],[11,7,11,10],[12,3,12,4],[12,5,12,6],[12,7,12,8],[12,9,12,10],[12,13,12,14],[12,15,12,16],[12,23,12,24],[13,1,13,2],[13,3,13,4],[13,5,13,6],[13,7,13,8],[13,9,13,10],[13,11,13,12],[13,13,13,14],[13,15,13,16],[13,17,13,18],[13,19,13,20],[13,21,13,22],[13,23,13,24],[13,25,13,26],[24,0,24,22]]}
[" ",{"$nulls":25},"Prospetto 5.2 (rami 10+12)"]
["Impresa ",null,{"$f":"IF(ISERROR('Foglio Informativo'!C4),\"\",'Foglio Informativo'!C4)","v":" << Fare click per selezionare la compagnia >> "},{"$nulls":23},{"$f":"IF('Foglio Informativo'!J4 = 0,\"\",'Foglio Informativo'!J4)","v":"   "}]
[null,null,"(denominazione)",{"$nulls":23},"(codice)"]
[]
[{"$nulls":14},"Informazioni tecniche relative ai rami 10 + 12"]
[{"$nulls":16},"Portafoglio italiano - lavoro diretto  - Esercizio  ",null,{"$f":"'Foglio Informativo'!D6","v":"2019"}]
[{"$nulls":14},"Gen N-1 e prec."]
[]
[{"$nulls":26},"(Importi in migliaia di euro)"]
[null,"Sinistri a riserva all'inizio dell'esercizio al netto delle stime per sinistri tardivi ",{"$nulls":9},"Sinistri in entrata nell'esercizio",{"$nulls":5},"Riserva residua alla fine dell'esercizio",{"$nulls":5},"Riserva sinistri alla fine dell'esercizio al netto delle stime per sinistri tardivi"]
[null,"Riserva iniziale     (R0)",null,"Sinistri pagati nell'esercizio ",{"$nulls":7},"Movimenti in entrata per modifica della procedura di regolazione dei sinistri                            (R6)",null,"Sinistri pagati nell'esercizio ",{"$nulls":3},"Sinistri pagati parzialmente        (R7)",null,"Sinistri non movimentati nell'esercizio                (R8)",null,"Riserva residua totale                     (R9)",null,"Sinistri a riserva all'inizio dell'esercizio",null,"Sinistri in entrata nell'esercizio                (R13)"]
[{"$nulls":3},"A titolo definitivo",{"$nulls":3},"A titolo parziale"]
[{"$nulls":3},"Pagamenti              (A)",null,"Riserva caduta                     (R1)",null,"Pagamenti                              (B)",null,"Riserva caduta                      (R2)",{"$nulls":3},"a titolo definitivo                       (H)",null,"a titolo parziale             (I)",{"$nulls":7},"(Riv.)/Riduz.                      Riserva residua                        (S2)"]
[null,"Importo",null,"Importo",null,"Importo",null,"Importo",null,"Importo",null,"Importo",null,"Importo",null,"Importo",null,"Importo",null,"Importo",null,"Importo",null,"Importo",null,"Importo"]
["Sinistri No Card (*)",{"v":1,"d":" 1"},0,6,0,{"v":11,"d":" 11"},0,{"v":16,"d":" 16"},0,{"v":21,"d":" 21"},0,{"v":26,"d":" 26"},0,{"v":31,"d":" 31"},0,{"v":36,"d":" 36"},0,{"v":41,"d":" 41"},0,{"v":46,"d":" 46"},0,{"v":51,"d":" 51"},0,{"v":56,"d":" 56"},0,{"v":61,"d":" 61"},0]
["Sinistri Card (*)",{"$f":"B15+1","v":{"v":2,"d":" 2"}},0,{"$f":"D15+1","v":{"v":7,"d":" 7"}},0,{"$f":"F15+1","v":{"v":12,"d":" 12"}},0,{"$f":"H15+1","v":{"v":17,"d":" 17"}},0,{"$f":"J15+1","v":{"v":22,"d":" 22"}},0,{"$f":"L15+1","v":{"v":27,"d":" 27"}},0,{"$f":"N15+1","v":{"v":32,"d":" 32"}},0,{"$f":"P15+1","v":{"v":37,"d":" 37"}},0,{"$f":"R15+1","v":{"v":42,"d":" 42"}},0,{"$f":"T15+1","v":{"v":47,"d":" 47"}},0,{"$f":"V15+1","v":{"v":52,"d":" 52"}},0,{"$f":"X15+1","v":{"v":57,"d":" 57"}},0,{"$f":"Z15+1","v":{"v":62,"d":" 62"}},0]
["Forfait gestionaria (*)",{"$f":"B16+1","v":{"v":3,"d":" 3"}},0,{"v":8,"d":" 8"},0,{"v":13,"d":" 13"},0,{"v":18,"d":" 18"},0,{"v":23,"d":" 23"},0,{"v":28,"d":" 28"},0,{"v":33,"d":" 33"},0,{"v":38,"d":" 38"},0,{"$f":"R16+1","v":{"v":43,"d":" 43"}},0,{"v":48,"d":" 48"},0,{"v":53,"d":" 53"},0,{"v":58,"d":" 58"},0,{"v":63,"d":" 63"},0]
["Forfait debitrice (*)",{"v":4,"d":" 4"},0,{"v":9,"d":" 9"},0,{"v":14,"d":" 14"},0,{"v":19,"d":" 19"},0,{"v":24,"d":" 24"},0,{"v":29,"d":" 29"},0,{"v":34,"d":" 34"},0,{"v":39,"d":" 39"},0,{"v":44,"d":" 44"},0,{"v":49,"d":" 49"},0,{"v":54,"d":" 54"},0,{"v":59,"d":" 59"},0,{"v":64,"d":" 64"},0]
["Totale..................",{"v":5,"d":" 5"},{"$f":"C15+C16-C17+C18","v":0},{"v":10,"d":" 10"},{"$f":"E15+E16-E17+E18","v":0},{"v":15,"d":" 15"},{"$f":"G15+G16-G17+G18","v":0},{"v":20,"d":" 20"},{"$f":"I15+I16-I17+I18","v":0},{"v":25,"d":" 25"},{"$f":"K15+K16-K17+K18","v":0},{"v":30,"d":" 30"},{"$f":"M15+M16-M17+M18","v":0},{"v":35,"d":" 35"},{"$f":"O15+O16-O17+O18","v":0},{"v":40,"d":" 40"},{"$f":"Q15+Q16-Q17+Q18","v":0},{"v":45,"d":" 45"},{"$f":"S15+S16-S17+S18","v":0},{"v":50,"d":" 50"},{"$f":"U15+U16-U17+U18","v":0},{"v":55,"d":" 55"},{"$f":"W15+W16-W17+W18","v":0},{"v":60,"d":" 60"},{"$f":"Y15+Y16-Y17+Y18","v":0},{"v":65,"d":" 65"},{"$f":"AA15+AA16-AA17+AA18","v":0}]
[]
["Sinistri gestiti (**)",{"v":66,"d":" 66"},0,{"$f":"B21+1","v":{"v":67,"d":" 67"}},0,{"$f":"D21+1","v":{"v":68,"d":" 68"}},0,{"$f":"F21+1","v":{"v":69,"d":" 69"}},0,{"$f":"H21+1","v":{"v":70,"d":" 70"}},0,{"$f":"J21+1","v":{"v":71,"d":" 71"}},0,{"$f":"L21+1","v":{"v":72,"d":" 72"}},0,{"$f":"N21+1","v":{"v":73,"d":" 73"}},0,{"$f":"P21+1","v":{"v":74,"d":" 74"}},0,{"$f":"R21+1","v":{"v":75,"d":" 75"}},0,{"$f":"T21+1","v":{"v":76,"d":" 76"}},0,{"$f":"V21+1","v":{"v":77,"d":" 77"}},0,{"$f":"X21+1","v":{"v":78,"d":" 78"}},0]
[]
[]
[]
["(*)     I principi di compilazione per le quattro tipologie di gestione sono gli stessi indicati nelle istruzioni relative ai moduli 29A.1, 29A.2, 29A.3 e 29A.4."]
["          In particolare, devono essere riportati gli importi di cui alle colonne (R0), (A), (R1), (B), (R2), (R6), H), (I), R7), (R8), (R9), (S2) ed (R13)."]
["(**)   I principi di compilazione sono gli stessi indicati nelle istruzioni relative al modulo 29B. "]
["          In particolare, devono essere riportati gli importi di cui alle colonne (R0), (A), (R1), (B), (R2), (R6), H), (I), R7), (R8), (R9), (S2) ed (R13)."]
[]
[]
["voce 5 = voci (1+2-3+4)"]
["voce 10 = voci (6+7-8+9)"]
["voce 15 = voci (11+12-13+14)"]
["voce 20= voci (16+17-18+19)"]
["voce 25 = voci (21+22-23+24)"]
["voce 30 = voci (26+27-28+29)"]
["voce 35 = voci (31+32-33+34)"]
["voce 40 = voci (36+37-38+39)"]
["voce 45 = voci (41+42-43+44)"]
["voce 50 = voci (46+47-48+49)"]
["voce 55 = voci (51+52-53+54)"]
["voce 60 = voci (56+57-58+59)"]
["voce 65 = voci (61+62-63+64)"]

{"sheet":"prospetto 5.3a","index":10,"n_rows":53,"n_cols":25,"rows_kept":53,"merged":[[6,1,6,6],[6,7,6,12],[6,13,6,18],[6,19,6,24],[7,1,7,2],[7,3,7,4],[7,5,7,6],[7,7,7,8],[7,9,7,10],[7,13,7,14],[7,15,7,16],[7,17,7,18],[7,19,7,20],[7,21,7,22],[7,23,7,24],[8,1,8,2],[8,3,8,4],[8,5,8,6],[8,7,8,8],[8,9,8,10],[8,11,8,12],[8,13,8,14],[8,15,8,16],[8,17,8,18],[8,19,8,20],[8,21,8,22],[8,23,8,24]]}
[{"$nulls":24},"Prospetto 5.3a (rami 10+12)"]
["Impresa ",{"$f":"IF(ISERROR('Foglio Informativo'!C4),\"\",'Foglio Informativo'!C4)","v":" << Fare click per selezionare la compagnia >> "},{"$nulls":22},{"$f":"IF('Foglio Informativo'!J4 = 0,\"\",'Foglio Informativo'!J4)","v":"   "}]
[null,"(denominazione)",{"$nulls":22},"(codice)"]
[{"$nulls":13},"Informazioni tecniche relative ai rami 10 + 12"]
[{"$nulls":15},"Portafoglio italiano - lavoro diretto - Esercizio  ",{"$f":"'Foglio Informativo'!D6","v":"2019"}]
[{"$nulls":24},"(Importi in migliaia di euro)"]
[null,"SINISTRI NO CARD (*)",{"$nulls":5},"SINISTRI CARD (*)",{"$nulls":5},"FORFAIT GESTIONARIA (*)",{"$nulls":5},"FORFAIT DEBITRICE (*)"]
["Anno di accadimento","Totale sinistri pagati nell'esercizio (J)",null,"Riserva finale al netto  della stima per sinistri tardivi                         (R14)",null,"Riserva finale stimata per sinistri tardivi (R15)",null,"Totale sinistri pagati nell'esercizio (J)",null,"Riserva finale al netto  della stima per sinistri tardivi                               (R14)",null,"Riserva finale stimata per sinistri tardivi                       (R15)",null,"Totale sinistri pagati nell'esercizio (J)",null,"Riserva finale al netto  della stima per sinistri tardivi                        (R14)",null,"Riserva finale stimata per sinistri tardivi                               (R15)",null,"Totale sinistri pagati nell'esercizio (J)",null,"Riserva finale al netto  della stima per sinistri tardivi                           (R14)",null,"Riserva finale stimata per sinistri tardivi                   (R15)"]
[null,"Importo (**)",null,"Importo",null,"Importo",null,"Importo (**)",null,"Importo",null,"Importo",null,"Importo (**)",null,"Importo",null,"Importo",null,"Importo (**)",null,"Importo",null,"Importo"]
["N-12 e prec.",1,0,{"$f":"+B24+1","v":16},0,{"$f":"+D24+1","v":31},0,{"$f":"+F24+1","v":46},0,{"$f":"+H24+1","v":61},0,{"$f":"+J24+1","v":76},0,{"$f":"+L24+1","v":91},0,{"$f":"+N24+1","v":106},0,{"$f":"+P24+1","v":121},0,{"$f":"+R24+1","v":136},0,{"$f":"+T24+1","v":151},0,{"$f":"+V24+1","v":166},0]
["N-11",{"$f":"+B10+1","v":2},0,{"$f":"+D10+1","v":17},0,{"$f":"+F10+1","v":32},0,{"$f":"+H10+1","v":47},0,{"$f":"+J10+1","v":62},0,{"$f":"+L10+1","v":77},0,{"$f":"+N10+1","v":92},0,{"$f":"+P10+1","v":107},0,{"$f":"+R10+1","v":122},0,{"$f":"+T10+1","v":137},0,{"$f":"+V10+1","v":152},0,{"$f":"+X10+1","v":167},0]
["N-10",3,0,18,0,33,0,48,0,63,0,78,0,93,0,108,0,123,0,138,0,153,0,168,0]
["N-9",4,0,19,0,34,0,49,0,64,0,79,0,94,0,109,0,124,0,139,0,154,0,169,0]
["N-8",5,0,20,0,35,0,50,0,65,0,80,0,95,0,110,0,125,0,140,0,155,0,170,0]
["N-7",6,0,21,0,36,0,51,0,66,0,81,0,96,0,111,0,126,0,141,0,156,0,171,0]
["N-6",7,0,22,0,37,0,52,0,67,0,82,0,97,0,112,0,127,0,142,0,157,0,172,0]
["N-5",8,0,23,0,38,0,53,0,68,0,83,0,98,0,113,0,128,0,143,0,158,0,173,0]
["N-4",9,0,24,0,39,0,54,0,69,0,84,0,99,0,114,0,129,0,144,0,159,0,174,0]
["N-3",10,0,25,0,40,0,55,0,70,0,85,0,100,0,115,0,130,0,145,0,160,0,175,0]
["N-2",11,0,26,0,41,0,56,0,71,0,86,0,101,0,116,0,131,0,146,0,161,0,176,0]
["N-1",12,0,27,0,42,0,57,0,72,0,87,0,102,0,117,0,132,0,147,0,162,0,177,0]
["Tot.  prec.",13,{"$f":"SUM(C10:C21)","v":0},28,{"$f":"SUM(E10:E21)","v":0},43,{"$f":"SUM(G10:G21)","v":0},58,{"$f":"SUM(I10:I21)","v":0},73,{"$f":"SUM(K10:K21)","v":0},88,{"$f":"SUM(M10:M21)","v":0},103,{"$f":"SUM(O10:O21)","v":0},118,{"$f":"SUM(Q10:Q21)","v":0},133,{"$f":"SUM(S10:S21)","v":0},148,{"$f":"SUM(U10:U21)","v":0},163,{"$f":"SUM(W10:W21)","v":0},178,{"$f":"SUM(Y10:Y21)","v":0}]
["N",14,0,29,0,44,0,59,0,74,0,89,0,104,0,119,0,134,0,149,0,164,0,179,0]
["Tot. generale",15,{"$f":"SUM(C22:C23)","v":0},30,{"$f":"SUM(E22:E23)","v":0},45,{"$f":"SUM(G22:G23)","v":0},60,{"$f":"SUM(I22:I23)","v":0},75,{"$f":"SUM(K22:K23)","v":0},90,{"$f":"SUM(M22:M23)","v":0},105,{"$f":"SUM(O22:O23)","v":0},120,{"$f":"SUM(Q22:Q23)","v":0},135,{"$f":"SUM(S22:S23)","v":0},150,{"$f":"SUM(U22:U23)","v":0},165,{"$f":"SUM(W22:W23)","v":0},180,{"$f":"SUM(Y22:Y23)","v":0}]
[]
["(*) I principi di compilazione per le quattro tipologie sono gli stessi indicati nelle istruzioni relative ai moduli 29A.1, 29A.2, 29A.3 e 29A.4."]
["    In particolare, devono essere riportati gli importi di cui alle colonne J, R14 e R15"]
[]
["(**) L'ammontare del contributo al Fondo di Garanzia per le Vittime della Strada non deve essere compreso tra gli importi pagati"]
["voce 13 = somma voci (1...12)"]
["voce 15 = voci (13+14)"]
["voce 28 = somma voci (16...27)"]
["voce 30 = voci (28+29)"]
["voce 43 = somma voci (31...42)"]
["voce 45 = voci (43+44)"]
["voce 58 = somma voci (46...57)"]
["voce 60 = voci (58+59)"]
["voce 73 = somma voci (61...72)"]
["voce 75 = voci (73+74)"]
["voce 88 = somma voci (76...87)"]
["voce 90 = voci (88+89)"]
["voce 103 = somma voci (91...102)"]
["voce 105 = voci (103+104)"]
["voce 118 = somma voci (106...117)"]
["voce 120 = voci (118+119)"]
["voce 133 = somma voci (121...132)"]
["voce 135 = voci (133+134)"]
["voce 148 = somma voci (136...147)"]
["voce 150 = voci (148+149)"]
["voce 163 = somma voci (151...162)"]
["voce 165 = voci (163+164)"]
["voce 178 = somma voci (166...177)"]
["voce 180 = voci (178+179)"]

{"sheet":"prospetto 5.3b","index":11,"n_rows":59,"n_cols":31,"rows_kept":59,"merged":[[6,1,6,6],[6,7,6,12],[6,13,6,18],[6,19,6,24],[6,25,6,30],[7,1,7,2],[7,3,7,4],[7,5,7,6],[7,7,7,8],[7,9,7,10],[7,11,7,12],[7,13,7,14],[7,15,7,16],[7,17,7,18],[7,19,7,20],[7,21,7,22],[7,23,7,24],[7,25,7,26],[7,27,7,28],[7,29,7,30],[8,1,8,2],[8,3,8,4],[8,5,8,6],[8,7,8,8],[8,9,8,10],[8,11,8,12],[8,13,8,14],[8,15,8,16],[8,17,8,18],[8,19,8,20],[8,21,8,22],[8,23,8,24],[8,25,8,26],[8,27,8,28],[8,29,8,30]]}
[{"$nulls":30},"Prospetto 5.3b (rami 10+12)"]
["Impresa ",{"$f":"IF(ISERROR('Foglio Informativo'!C4),\"\",'Foglio Informativo'!C4)","v":" << Fare click per selezionare la compagnia >> "},{"$nulls":28},{"$f":"IF('Foglio Informativo'!J4 = 0,\"\",'Foglio Informativo'!J4)","v":"   "}]
[null,"(denominazione)",{"$nulls":28},"(codice)"]
[{"$nulls":13},"Informazioni tecniche relative ai rami 10 + 12"]
[{"$nulls":15},"Portafoglio italiano - lavoro diretto - Esercizio  ",{"$f":"'Foglio Informativo'!D6","v":"2019"}]
[]
[null,"SINISTRI NO CARD (*)",{"$nulls":5},"SINISTRI CARD (*)",{"$nulls":5},"FORFAIT GESTIONARIA (*)",{"$nulls":5},"FORFAIT DEBITRICE (*)",{"$nulls":5},"SINISTRI GESTITI (*)"]
["Anno di accadimento","Totale sinistri pagati nell'esercizio                            (j)",null,"Riserva finale al netto  della stima per sinistri tardivi            (r14)",null,"Riserva finale stimata per sinistri tardivi                                 (r15)",null,"Totale sinistri pagati nell'esercizio                              (j)",null,"Riserva finale al netto  della stima per sinistri tardivi                (r14)",null,"Riserva finale stimata per sinistri tardivi                              (r15)",null,"Totale sinistri pagati nell'esercizio                      (j)",null,"Riserva finale al netto  della stima per sinistri tardivi                              (r14)",null,"Riserva finale stimata per sinistri tardivi                                               (r15)",null,"Totale sinistri pagati nell'esercizio                         (j)",null,"Riserva finale al netto  della stima per sinistri tardivi                                     (r14)",null,"Riserva finale stimata per sinistri tardivi                                      (r15)",null,"Totale sinistri pagati nell'esercizio                                  (j)",null,"Riserva finale al netto  della stima per sinistri tardivi                                                 (r14)",null,"Riserva finale stimata per sinistri tardivi                                 (r15)"]
[null,"Numero",null,"Numero",null,"Numero",null,"Numero",null,"Numero",null,"Numero",null,"Numero",null,"Numero",null,"Numero",null,"Numero",null,"Numero",null,"Numero",null,"Numero",null,"Numero",null,"Numero"]
["N-12 e prec.",1,0,{"$f":"+B24+1","v":16},0,{"$f":"+D24+1","v":31},0,{"$f":"+F24+1","v":46},0,{"$f":"+H24+1","v":61},0,{"$f":"+J24+1","v":76},0,{"$f":"+L24+1","v":91},0,{"$f":"+N24+1","v":106},0,{"$f":"+P24+1","v":121},0,{"$f":"+R24+1","v":136},0,{"$f":"+T24+1","v":151},0,{"$f":"+V24+1","v":166},0,{"$f":"+X24+1","v":181},0,{"$f":"+Z24+1","v":196},0,{"$f":"+AB24+1","v":211},0]
["N-11",{"$f":"+B10+1","v":2},0,{"$f":"+D10+1","v":17},0,{"$f":"+F10+1","v":32},0,{"$f":"+H10+1","v":47},0,{"$f":"+J10+1","v":62},0,{"$f":"+L10+1","v":77},0,{"$f":"+N10+1","v":92},0,{"$f":"+P10+1","v":107},0,{"$f":"+R10+1","v":122},0,{"$f":"+T10+1","v":137},0,{"$f":"+V10+1","v":152},0,{"$f":"+X10+1","v":167},0,{"$f":"+Z10+1","v":182},0,{"$f":"+AB10+1","v":197},0,{"$f":"+AD10+1","v":212},0]
["N-10",3,0,18,0,33,0,48,0,63,0,78,0,93,0,108,0,123,0,138,0,153,0,168,0,183,0,198,0,213,0]
["N-9",4,0,19,0,34,0,49,0,64,0,79,0,94,0,109,0,124,0,139,0,154,0,169,0,184,0,199,0,214,0]
["N-8",5,0,20,0,35,0,50,0,65,0,80,0,95,0,110,0,125,0,140,0,155,0,170,0,185,0,200,0,215,0]
["N-7",6,0,21,0,36,0,51,0,66,0,81,0,96,0,111,0,126,0,141,0,156,0,171,0,186,0,201,0,216,0]
["N-6",7,0,22,0,37,0,52,0,67,0,82,0,97,0,112,0,127,0,142,0,157,0,172,0,187,0,202,0,217,0]
["N-5",8,0,23,0,38,0,53,0,68,0,83,0,98,0,113,0,128,0,143,0,158,0,173,0,188,0,203,0,218,0]
["N-4",9,0,24,0,39,0,54,0,69,0,84,0,99,0,114,0,129,0,144,0,159,0,174,0,189,0,204,0,219,0]
["N-3",10,0,25,0,40,0,55,0,70,0,85,0,100,0,115,0,130,0,145,0,160,0,175,0,190,0,205,0,220,0]
["N-2",11,0,26,0,41,0,56,0,71,0,86,0,101,0,116,0,131,0,146,0,161,0,176,0,191,0,206,0,221,0]
["N-1",12,0,27,0,42,0,57,0,72,0,87,0,102,0,117,0,132,0,147,0,162,0,177,0,192,0,207,0,222,0]
["Tot.  prec.",13,{"$f":"SUM(C10:C21)","v":0},28,{"$f":"SUM(E10:E21)","v":0},43,{"$f":"SUM(G10:G21)","v":0},58,{"$f":"SUM(I10:I21)","v":0},73,{"$f":"SUM(K10:K21)","v":0},88,{"$f":"SUM(M10:M21)","v":0},103,{"$f":"SUM(O10:O21)","v":0},118,{"$f":"SUM(Q10:Q21)","v":0},133,{"$f":"SUM(S10:S21)","v":0},148,{"$f":"SUM(U10:U21)","v":0},163,{"$f":"SUM(W10:W21)","v":0},178,{"$f":"SUM(Y10:Y21)","v":0},193,{"$f":"SUM(AA10:AA21)","v":0},208,{"$f":"SUM(AC10:AC21)","v":0},223,{"$f":"SUM(AE10:AE21)","v":0}]
["N",14,0,29,0,44,0,59,0,74,0,89,0,104,0,119,0,134,0,149,0,164,0,179,0,194,0,209,0,224,0]
["Tot. generale",15,{"$f":"SUM(C22:C23)","v":0},30,{"$f":"SUM(E22:E23)","v":0},45,{"$f":"SUM(G22:G23)","v":0},60,{"$f":"SUM(I22:I23)","v":0},75,{"$f":"SUM(K22:K23)","v":0},90,{"$f":"SUM(M22:M23)","v":0},105,{"$f":"SUM(O22:O23)","v":0},120,{"$f":"SUM(Q22:Q23)","v":0},135,{"$f":"SUM(S22:S23)","v":0},150,{"$f":"SUM(U22:U23)","v":0},165,{"$f":"SUM(W22:W23)","v":0},180,{"$f":"SUM(Y22:Y23)","v":0},195,{"$f":"SUM(AA22:AA23)","v":0},210,{"$f":"SUM(AC22:AC23)","v":0},225,{"$f":"SUM(AE22:AE23)","v":0}]
[]
["(*) I principi di compilazione per le quattro tipologie sono gli stessi indicati nelle istruzioni relative ai moduli 29A.1, 29A.2, 29A.3, 29A.4 e 29B"]
["    In particolare, devono essere riportati i numeri di cui alle colonne j, r14 e r15"]
[]
[]
["voce 13 = somma voci (1...12)"]
["voce 15 = voci (13+14)"]
["voce 28 = somma voci (16...27)"]
["voce 30 = voci (28+29)"]
["voce 43 = somma voci (31...42)"]
["voce 45 = voci (43+44)"]
["voce 58 = somma voci (46...57)"]
["voce 60 = voci (58+59)"]
["voce 73 = somma voci (61...72)"]
["voce 75 = voci (73+74)"]
["voce 88 = somma voci (76...87)"]
["voce 90 = voci (88+89)"]
["voce 103 = somma voci (91...102)"]
["voce 105 = voci (103+104)"]
["voce 118 = somma voci (106...117)"]
["voce 120 = voci (118+119)"]
["voce 133 = somma voci (121...132)"]
["voce 135 = voci (133+134)"]
["voce 148 = somma voci (136...147)"]
["voce 150 = voci (148+149)"]
["voce 163 = somma voci (151...162)"]
["voce 165 = voci (163+164)"]
["voce 178 = somma voci (166...177)"]
["voce 180 = voci (178+179)"]
["voce 193 = somma voci (181…192)"]
["voce 195 = voci (193+194)"]
["voce 208 = somma voci (196…207)"]
["voce 210= voci (208+209)"]
["voce 223 = somma voci (211…222)"]
["voce 225 = voci (223+224)"]

{"sheet":"prospetto 5.4","index":12,"n_rows":38,"n_cols":10,"rows_kept":38,"hidden":true,"merged":[[7,1,7,2],[7,3,7,4],[8,1,8,2],[8,3,8,4],[8,5,8,6]]}
[{"$nulls":7},"Prospetto 5.4 (ramo 13)"]
["Impresa ",{"$f":"IF(ISERROR('Foglio Informativo'!C4),\"\",'Foglio Informativo'!C4)","v":" << Fare click per selezionare la compagnia >> "},{"$nulls":7},{"$f":"IF('Foglio Informativo'!J4 = 0,\"\",'Foglio Informativo'!J4)","v":"   "}]
[null,"(denominazione)",{"$nulls":7},"(codice)"]
[]
[null,"Informazioni tecniche relative al ramo 13"]
[null,"Portafoglio italiano - lavoro diretto - Esercizio  ",{"$nulls":4},{"$f":"'Foglio Informativo'!D6","v":"2019"}]
[{"$nulls":6},"(Importi in migliaia di euro)"]
["Anno di accadimento","Totale sinistri pagati nell'esercizio (J)\n(*)",null,"Riserva finale al netto  della stima per sinistri tardivi (R11)\n(*)",null,"Riserva finale stimata per sinistri tardivi (12)\n(*)"]
[null,"Importo",null,"Importo",null,"Importo"]
["N-12 e prec.",1,0,{"$f":"+B24+1","v":16},0,{"$f":"+D24+1","v":31},0]
["N-11",{"$f":"+B10+1","v":2},0,{"$f":"+D10+1","v":17},0,{"$f":"+F10+1","v":32},0]
["N-10",3,0,18,0,33,0]
["N-9",4,0,19,0,34,0]
["N-8",5,0,20,0,35,0]
["N-7",6,0,21,0,36,0]
["N-6",7,0,22,0,37,0]
["N-5",8,0,23,0,38,0]
["N-4",9,0,24,0,39,0]
["N-3",10,0,25,0,40,0]
["N-2",11,0,26,0,41,0]
["N-1",12,0,27,0,42,0]
["Tot.  prec.",13,{"$f":"SUM(C10:C21)","v":0},28,{"$f":"SUM(E10:E21)","v":0},43,{"$f":"SUM(G10:G21)","v":0}]
["N",14,0,29,0,44,0]
["Tot. generale",15,{"$f":"SUM(C22:C23)","v":0},30,{"$f":"SUM(E22:E23)","v":0},45,{"$f":"SUM(G22:G23)","v":0}]
[]
[]
[]
[]
["(*) I principi di compilazione  sono gli stessi indicati nelle istruzioni relative al modulo 29 e relativo allegato 1"]
["    In particolare, devono essere riportati gli importi di cui alle colonne J, R11 del modulo 29 e, per la "]
["    riserva finale stimata per sinistri tardivi, colonna 12 dell'allegato 1 al modulo 29"]
[]
["voce 13 = somma voci (1...12)"]
["voce 15 = voci (13+14)"]
["voce 28 = somma voci (16...27)"]
["voce 30 = voci (28+29)"]
["voce 43 = somma voci (31...42)"]
["voce 45 = voci (43+44)"]

{"sheet":"prospetto 6","index":13,"n_rows":25,"n_cols":19,"rows_kept":25,"merged":[[1,2,1,4],[5,7,5,8],[6,7,6,8],[6,13,6,14],[6,17,6,18],[11,2,11,3],[12,2,12,3],[13,2,13,3]]}
[{"$nulls":18},"Prospetto 6"]
["Impresa",null,{"$f":"IF(ISERROR('Foglio Informativo'!C4),\"\",'Foglio Informativo'!C4)","v":" << Fare click per selezionare la compagnia >> "},{"$f":"IF(ISERROR('Foglio Informativo'!D4),\"\",'Foglio Informativo'!D4)","v":0},{"$f":"IF(ISERROR('Foglio Informativo'!E4),\"\",'Foglio Informativo'!E4)","v":0},null,{"$f":"IF('Foglio Informativo'!J4 = 0,\"\",'Foglio Informativo'!J4)","v":"   "},{"$nulls":10},"Esercizio ",{"$f":"'Foglio Informativo'!D6","v":"2019"}]
[null,null,"(denominazione)",{"$nulls":3},"(codice)"]
["Rami vita - Portafoglio diretto italiano - Dettaglio per ramo dei premi contabilizzati",{"$nulls":17},"(Valori in migliaia di Euro)"]
[]
[]
[{"$nulls":5},"Premi di 1° annualità",null,"Premi di  annualità successive",null,"Premi unici",null,"Premi complessivi",null,"Oneri relativi ai sinistri",null,"Riscatti",null,"Capitali e rendite maturati"]
[{"$nulls":5},"(1)",null,"(2)",null,"(3)",null,"(4)",null,"(5)",null,"(6)",null,"(7)"]
[]
[null,"I.","Le assicurazioni sulla durata della vita umana ............................................................................................................................",null," ",{"$f":"1","v":1},0,11,0,21,0,31,{"$f":"SUM(G10,I10,K10)","v":0},41,0,51,0,61,0]
[null,"II.","Le assicurazioni di nuzialità e natalità .....................................................................................................................",null," ",{"$f":"F10+1","v":2},0,{"$f":"H10+1","v":12},0,{"$f":"J10+1","v":22},0,{"$f":"L10+1","v":32},{"$f":"SUM(G11,I11,K11)","v":0},42,0,{"$f":"P10+1","v":52},0,{"$f":"R10+1","v":62},0]
[null,"III.","Le assicurazioni di cui ai punti I e II connesse con fondi di investimento .........……………..……...…..….…",null," ",3,0,13,0,23,0,33,0,43,0,53,0,63,0]
[null,"IV.","L'assicurazione malattia di cui art. 1, n. 1 lettera d) dir. \nCEE 79/267 ..............................…...............................…",null," ",4,0,14,0,24,0,34,0,44,0,54,0,64,0]
[null,"V.","Le operazioni di capitalizzazione di cui all'art. 40 D.lgs. 174/95 ..............................................................................",null," ",5,0,15,0,25,0,35,0,45,0,55,0,65,0]
[null,"VI.","Le operazioni di gestione di fondi pensione ................................................................",null," ",6,0,16,0,26,0,36,0,46,0,56,0,66,0]
[null,"Totale .....................................................................................................................................",null,null," ",7,{"$f":"G10+G11+G12+G13+G14+G15","v":0},17,{"$f":"I10+I11+I12+I13+I14+I15","v":0},27,{"$f":"K10+K11+K12+K13+K14+K15","v":0},37,0,47,{"$f":"O10+O11+O12+O13+O14+O15","v":0},57,{"$f":"Q10+Q11+Q12+Q13+Q14+Q15","v":0},67,{"$f":"S10+S11+S12+S13+S14+S15","v":0}]
[{"$nulls":4}," "]
[]
["(1)","Modulo 20 voce 1"]
["(2)","Modulo 20 voce 2"]
["(3)","Modulo 20 voce 3"]
["(4)","Modulo 20 voce 4"]
["(5)","Modulo 20 voce 22"]
["(6)","Modulo 20 voci 13 + 18 - 7"]
["(7)","Modulo 20 voci 12 + 17 - 6 "]

{"sheet":"prospetto 7.1","index":14,"n_rows":58,"n_cols":8,"rows_kept":58,"hidden":true,"merged":[[0,0,0,7],[7,0,7,3],[7,4,7,5],[7,6,7,7],[10,1,10,2],[11,1,11,2],[17,1,17,2],[18,1,18,2],[19,1,19,2],[24,1,24,2],[25,1,25,2],[26,1,26,2],[27,1,27,2],[32,1,32,2],[33,1,33,2],[34,1,34,2],[35,1,35,2],[36,1,36,2],[37,1,37,2],[38,1,38,2],[39,1,39,2],[40,1,40,2],[41,1,41,2],[42,1,42,2],[43,1,43,2],[44,1,44,2],[45,1,45,2],[46,1,46,2],[47,1,47,2],[48,1,48,2],[50,1,50,2],[51,0,51,7],[53,2,53,5],[55,1,55,3],[55,4,55,5],[56,1,56,3],[57,2,57,3]]}
["Prospetto di copertura delle riserve tecniche con evidenza dei valori al 31 dicembre dell'esercizio senza tenere conto della facoltà concessa dall'art. 4, comma 1, del Regolamento ISVAP n. 43 del 12 luglio 2012 di valutare i titoli di debito emessi o garantiti da Stati dell'Unione Europea non destinati a permanere durevolmente nel proprio patrimonio compresi nella classe C.III dello Stato Patrimoniale Attivo all'ultimo valore approvato, ovvero, per i titoli non presenti nel portafoglio a tale data, al costo d'acquisizione, salvo perdite di carattere durevole, rispetto al valore desumibile dall'andamento dei mercati al 31 dicembre 2015"]
[{"$nulls":7},"Prospetto 7.1"]
["Impresa ",null,{"$f":"IF(ISERROR('Foglio Informativo'!C4),\"\",'Foglio Informativo'!C4)","v":" << Fare click per selezionare la compagnia >> "},{"$nulls":4},{"$f":"IF('Foglio Informativo'!J4 = 0,\"\",'Foglio Informativo'!J4)","v":"   "}]
[null,null,"(denominazione)",{"$nulls":4},"(codice)"]
[]
[null,null,"RAMI DANNI - Esercizio  ",{"$f":"'Foglio Informativo'!D6","v":"2019"}]
[{"$nulls":7},"(Valori in migliaia di Euro)"]
["Copertura delle riserve tecniche (ex art. 37 d.lgs. n. 209/05)\n\nModello 4 “Prospetto dimostrativo delle attività assegnate alla copertura delle riserve tecniche dei rami danni da allegare al bilancio di esercizio” di cui all’Allegato 4 al Regolamento ISVAP n. 36 del 31 gennaio 2011, come da ultimo modificato e integrato dal Provvedimento IVASS n. 22 del 21 ottobre 2014, Allegato D ",{"$nulls":3},"Valori di bilancio\nal 31 dicembre 2015",null,"Valori al 31 dicembre 2015 senza tenere conto dell'esercizio della facoltà di cui all'art. 4, comma 1, del Regolamento ISVAP n. 43 del 12 luglio 2012"]
["Riserve tecniche da coprire (voce 5)",{"$nulls":3},1,0,20,0]
["Totale generale attività a copertura delle riserve tecniche (voce 177)",{"$nulls":3},2,{"$f":"SUM(F11,F12,F18,F19,F20,F27,F28,F33:F48)","v":0},21,{"$f":"SUM(H11,F12,F18,F19:F20,F27:F28,F33:F48)","v":0}]
["di cui (*):","(A.1.1a, A.1.1b) Titoli di Stato  (voci 9+13)",null,null,3,0,22,0]
[null," (A.1.2a, A.1.2b, A.1.2c, A.1.2d, A.1.3, A.1.5) \nAltre obbligazioni (voci 17+21+513+517+25+33)",null,null,4,0]
[null,null,"di cui: (A.1.2c)  Obbligazioni ed altri titoli di debito emessi ai sensi dell'articolo 157, comma 1, del d. lgs. 163/2006….. La classe comprende le obbligazioni e gli altri titoli di debito che siano garantiti ai sensi dell'articolo 157, comma 3, del d.lgs. 163/2006... (voce 513)",null,121,0]
[null,null,"di cui: (A.1.2d) Obbligazioni, cambiali finanziarie e titoli similari ai sensi dell’art. 32, comma 26-bis, del decreto legge 22 giugno 2012 n. 83, anche se non destinati ad essere negoziati in un mercato regolamentato o in sistemi multilaterali di negoziazione e anche se privi di rating (voce 517) ",null,126,0]
[null,null,"di cui titoli non negoziati (voce 521)",null,127,0]
[null,null,"di cui (A.1.3) Altre obbligazioni o titoli assimilabili, diverse da quelle ……. precedenti, purché con scadenza residua inferiore all'anno  (voce 25)",null,128,0]
[null,null,"di cui: (A.1.5) Pronti contro termine, con obbligo di riacquisto e di deposito dei titoli (voce 33)",null,129,0]
[null,"(A.1.4) Quote di OICVM italiani e UE obbligazionari  (voce 29)",null,null,5,0]
[null,"(A.1.8) Ratei attivi per interessi su titoli idonei alla copertura delle riserve tecniche (voce 49) ",null,null,130,0]
[null,"[A.1.9 = A.1.9a) + A.1.9b) + A.1.9c)] Titoli di debito relativi ad operazioni di cartolarizzazione... (voce 525)",null,null,131,{"$f":"SUM(F21:F23)","v":0}]
[null,"di cui:","(A.1.9a) Titoli di debito relativi alle operazioni di cartolarizzazione di crediti di cui all’articolo 1, comma 1, della legge 30 aprile 1999, n. 130 privi del requisito di rating di cui alla macroclasse A1 (voce 533)",null,132,0]
[null,null,"(A.1.9b) Titoli di debito relativi ad operazioni di cartolarizzazione realizzate mediante la sottoscrizione o l'acquisto di obbligazioni e titoli similari ovvero cambiali finanziarie, esclusi comunque titoli rappresentativi del capitale sociale, titoli ibridi e convertibili di cui all’articolo 1, comma 1-bis, della legge 30 aprile 1999, n. 130 (voce 537)",null,133,0]
[null,null,"(A.1.9c) Titoli di debito relativi ad operazioni di cartolarizzazione di finanziamenti concessi da società di cartolarizzazione a soggetti diversi dalle persone fisiche e dalle microimprese ai sensi dell’articolo 1, comma 1-ter, della legge 30 aprile 1999, n. 130 (voce 541)",null,134,0]
[null,null,"di cui titoli non negoziati (voce 529)",null,135,0]
[null,"Titoli strutturati compresi nella macroclasse A.1 (voce 501)",null,null,108,0,117,0]
[null,"Cartolarizzazioni comprese nella macroclasse A.1 (voce 505)",null,null,109,0,118,0]
[null,"(A.2.1) Mutui e prestiti fruttiferi garantiti ...   (voce 57)",null,null,136,0]
[null,"[A.2.2 = A.2.2a) + A.2.2b) + A.2.2c) + A.2.2d)] Finanziamenti diretti non garantiti… (voce 549)",null,null,137,{"$f":"F29+F30+F31+F32","v":0}]
[null,"di cui:","(A2.2a) Finanziamenti diretti selezionati da una banca o da un intermediario finanziario ed in possesso di  tutte le caratteristiche sulla qualità dei prenditori e sul rapporto con l’intermediario (voce 553)",null,138,0]
[null,null,"(A2.2b) Finanziamenti diretti selezionati da una banca o da un intermediario finanziario ma non in possesso delle sole caratteristiche relative al prenditore di finanziamenti (voce 557)",null,139,0]
[null,null,"(A2.2c) Finanziamenti diretti selezionati da una banca o da un intermediario finanziario ma non in possesso delle caratteristiche relative al prenditore di finanziamenti e del rapporto con l’intermediario (voce 561)",null,140,0]
[null,null,"A2.2d) Finanziamenti diretti non selezionati da una banca o da un intermediario finanziario (voce 565)",null,141,0]
[null,"(A.3.1a) Azioni negoziate in un mercato regolament. (voce 61)",null,null,6,0]
[null,"(A.3.1.b) Azioni non negoz. in un mercato regolam. (voce 65)",null,null,7,0]
[null,"(A.3.3) Quote di OICVM italiani e UE azionari (voce 73)",null,null,8,0]
[null,"(A.3.4) Quote di FIA chiusi negoziate in un mercato regolamentato (voce 77)",null,null,101,0]
[null,"(A.4.1, A.4.2, A.4.3) Comparto immobiliare, al netto delle quote di quote di FIA immobiliari italiani (voci 85+89+93)",null,null,102,0]
[null,"(A.4.4) Quote di FIA immobiliari italiani (voce 97)",null,null,103,0]
[null,"(A.5.1a) Quote di FIA italiani e UE aperti che investono preval. nel comparto obbligazionario (voce 301)",null,null,104,0]
[null,"(A.5.1b) Quote di FIA italiani e UE aperti che investono preval. nel comparto azionario (voce 305) ",null,null,105,0]
[null,"(A.5.2a, A.5.2b) Quote di FIA italiani e UE chiusi non negoziate in un mercato regolamentato ed in Fia italiani riservati nonché quote di altri FIA italiani e UE aperti diversi dalle classi precedenti (voci 309+313) ",null,null,16,0]
[null,"(B.1, B.2, B.3.1, B.3.2, B.4) Crediti tecnici (voci 109+113+117+121+125)",null,null,10,0]
[null,"(B.5) Crediti di imposta (voce 129) ",null,null,11,0]
[null,"(B.6) Crediti verso fondi di garanzia al netto delle partite debitorie  (voce 133)",null,null,18,0]
[null,"(B.7) Crediti derivanti da operazioni di gestione accentrata della tesoreria di gruppo vantati nei confronti della società incaricata della gestione stessa (voce 401)",null,null,107,0]
[null,"(D) Depositi bancari (voce 169) ",null,null,12,0]
[null,"(C.1, C.2, C.3, C.4) Altri attivi (voci 141+145+153+157)",null,null,19,0]
[null,"(E) Altre categorie di attivo autorizzate dall'ISVAP (voce 173)",null,null,14,0]
[null,"Titoli di debito emessi o garantiti da Stati membri dell'Unione Europea compresi nelle classi A.1.1a e A.1.1b",null,null,119,0,122,0]
[null,"di cui:","Titoli di debito emessi o garantiti da Stati membri dell'Unione Europea compresi nelle classi A.1.1a e A.1.1b per i quali è stata esercitata la facoltà di cui all'art. 4, comma 1, del Regolamento ISVAP n. 43",null,120,0,123,0]
[]
["(*) Tra parentesi sono riportate sia l'indicazione delle classi di attivi a copertura delle riserve tecniche da aggregare che i corrispondenti numeri delle voci indicate nel Modello 4 “Prospetto dimostrativo delle attività assegnate alla copertura delle riserve tecniche dei rami danni da allegare al bilancio di esercizio” di cui all’Allegato 4 al Regolamento ISVAP n. 36 del 31 gennaio 2011, come da ultimo modificato e integrato dal Provvedimento IVASS n. 22 del 21 ottobre 2014, Allegato D  "]
[]
[null,null,"Attivi del patrimonio libero di cui all'art. 6, comma 2, del Regolamento ISVAP n. 43, di ammontare pari alla differenza generata dall'esercizio della facoltà di cui all'articolo 4, comma 1, del Regolamento 43 medesimo, relativa agli attivi a copertura."]
[]
[null,"Attivi",null,null,"Valori di bilancio al\n31 dicembre 2015"]
[null,"Totale attivi",null,null,124,{"$f":"F50-H50","v":0}]
[null,null,"di cui: Attivi idonei alla copertura delle riserve tecniche",null,125,0]

{"sheet":"prospetto 7.2","index":15,"n_rows":71,"n_cols":9,"rows_kept":71,"hidden":true,"merged":[[0,0,0,8],[7,0,7,4],[7,5,7,6],[7,7,7,8],[10,1,10,2],[11,1,11,3],[12,2,12,3],[13,2,13,3],[15,2,15,3],[16,2,16,3],[17,1,17,3],[18,1,18,3],[19,1,19,3],[20,2,20,3],[21,2,21,3],[22,2,22,3],[23,2,23,3],[24,1,24,3],[25,1,25,3],[26,1,26,3],[27,1,27,3],[28,2,28,3],[29,2,29,3],[30,2,30,3],[32,1,32,2],[33,1,33,2],[34,1,34,2],[35,1,35,3],[36,1,36,3],[37,1,37,2],[38,1,38,3],[39,1,39,3],[40,1,40,3],[41,1,41,3],[42,1,42,2],[43,1,43,3],[44,1,44,3],[45,1,45,3],[46,1,46,3],[47,1,47,2],[48,1,48,3],[49,2,49,3],[50,1,50,3],[53,0,53,8],[55,0,55,8],[57,3,57,4],[57,5,57,6],[60,0,60,2],[65,2,65,5],[68,1,68,2],[68,3,68,4],[68,5,68,6],[69,1,69,2]]}
["Prospetto di copertura delle riserve tecniche con evidenza dei valori al 31 dicembre dell'esercizio senza tenere conto della facoltà concessa dall'art. 4, comma 1, del Regolamento ISVAP n. 43 del 12 luglio 2012 di valutare i titoli di debito emessi o garantiti da Stati dell'Unione Europea non destinati a permanere durevolmente nel proprio patrimonio compresi nella classe C.III dello Stato Patrimoniale Attivo all'ultimo valore approvato, ovvero, per i titoli non presenti nel portafoglio a tale data, al costo d'acquisizione, salvo perdite di carattere durevole, rispetto al valore desumibile dall'andamento dei mercati al 31 dicembre 2015"]
[{"$nulls":8},"Prospetto 7.2"]
["Impresa ",null,{"$f":"IF(ISERROR('Foglio Informativo'!C4),\"\",'Foglio Informativo'!C4)","v":" << Fare click per selezionare la compagnia >> "},{"$nulls":5},{"$f":"IF('Foglio Informativo'!J4 = 0,\"\",'Foglio Informativo'!J4)","v":"   "}]
[null,null,"(denominazione)",{"$nulls":5},"(codice)"]
[]
[null,null,"RAMI VITA - Esercizio  ",{"$f":"'Foglio Informativo'!D6","v":"2019"},{"$nulls":4},"(Valori in migliaia di Euro)"]
[{"$nulls":8},"(Valori in migliaia di Euro)"]
["Copertura delle riserve tecniche (ex artt. 36 e 41, comma 4, d.lgs. n. 209/05) - Portafoglio diretto italiano\n\nModello 1 “Prospetto dimostrativo delle attività assegnate alla copertura delle riserve tecniche dei rami vita da allegare al bilancio di esercizio” di cui all’Allegato 4 al Regolamento ISVAP n. 36 del 31 gennaio 2011, come da ultimo modificato e integrato dal Provvedimento IVASS n. 22 del 21 ottobre 2014, Allegato C ",{"$nulls":4},"Valori di bilancio\nal 31 dicembre 2015",null,"Valori al 31 dicembre 2015 senza tenere conto dell'esercizio della facoltà di cui all'art. 4, comma 1, del Regolamento ISVAP n. 43 del 12 luglio 2012"]
["Riserve tecniche da coprire (voce 9)",{"$nulls":4},1,0,28,0]
["Totale generale attività a copertura delle riserve tecniche (voce 189)",{"$nulls":4},2,{"$f":"SUM(G11:G12,G18,G19,G20,G27,G28,G33:G48)","v":0},29,{"$f":"SUM(I11,G12,G18,G19,G20,G27,G28,G33:G48)","v":0}]
["di cui (*):","(A.1.1a, A.1.1b) Titoli di Stato  (voci 13+17)",{"$nulls":3},3,0,30,0]
[null," (A.1.2a, A.1.2b, A.1.2c, A.1.2.d, A.1.3, A.1.5) Altre obbligazioni (voci 21+25+513+517+29+37)",{"$nulls":3},4,0]
[null,null,"di cui: (A.1.2c)  Obbligazioni ed altri titoli di debito emessi ai sensi dell'articolo 157, comma 1, del d. lgs. 163/2006….. La classe comprende le obbligazioni e gli altri titoli di debito che siano garantiti ai sensi dell'articolo 157, comma 3, del d.lgs. 163/2006... (voce 513)",null,null,121,0]
[null,null,"di cui: (A.1.2d) Obbligazioni, cambiali finanziarie e titoli similari ai sensi dell’art. 32, comma 26-bis, del decreto legge 22 giugno 2012 n. 83, anche se non destinati ad essere negoziati in un mercato regolamentato o in sistemi multilaterali di negoziazione e anche se privi di rating (voce 517) ",null,null,126,0]
[null,null,"di cui titoli non negoziati (voce 521)",null,null,127,0]
[null,null,"di cui: (A.1.3) Altre obbligazioni o titoli assimilabili, diverse da quelle ……. precedenti, purché con scadenza residua inferiore all'anno  (voce 29)",null,null,128,0]
[null,null,"di cui: (A.1.5) Pronti contro termine, con obbligo di riacquisto e di deposito dei titoli (voce 37)",null,null,129,0]
[null,"(A.1.4) Quote di OICVM italiani e UE obbligazionari  (voce 33)",{"$nulls":3},5,0]
[null,"(A.1.8) Ratei attivi per interessi su titoli idonei alla copertura delle riserve tecniche (voce 53) ",{"$nulls":3},130,0]
[null,"[A.1.9 = A.1.9a) + A.1.9b) + A.1.9c)] Titoli di debito relativi ad operazioni di cartolarizzazione ... (voce 525)",{"$nulls":3},131,{"$f":"SUM(G21:G23)","v":0}]
[null,"di cui:","(A.1.9a) Titoli di debito relativi alle operazioni di cartolarizzazione di crediti di cui all’articolo 1, comma 1, della legge 30 aprile 1999, n. 130 privi del requisito di rating di cui alla macroclasse A1 (voce 533)",null,null,132,0]
[null,"di cui:","(A.1.9b) Titoli di debito relativi ad operazioni di cartolarizzazione realizzate mediante la sottoscrizione o l'acquisto di obbligazioni e titoli similari ovvero cambiali finanziarie, esclusi comunque titoli rappresentativi del capitale sociale, titoli ibridi e convertibili di cui all’articolo 1, comma 1-bis, della legge 30 aprile 1999, n. 130 (voce 537)",null,null,133,0]
[null,"di cui:"," (A.1.9c) Titoli di debito relativi ad operazioni di cartolarizzazione di finanziamenti concessi da società di cartolarizzazione a soggetti diversi dalle persone fisiche e dalle microimprese ai sensi dell’articolo 1, comma 1-ter, della legge 30 aprile 1999, n. 130 (voce 541)",null,null,134,0]
[null,null,"di cui titoli non negoziati (voce 529)",null,null,135,0]
[null,"Titoli strutturati compresi nella macroclasse A.1 (voce 501)",{"$nulls":3},108,0,117,0]
[null,"Cartolarizzazioni comprese nella macroclasse A.1 (voce 505)",{"$nulls":3},109,0,118,0]
[null,"(A.2.1) Mutui e prestiti fruttiferi garantiti ...   (voce 61)",{"$nulls":3},136,0]
[null," [A.2.2 = A.2.2a) + A.2.2b) + A.2.2c) + A.2.2d)] Finanziamenti diretti non garantiti… (voce 549)",{"$nulls":3},137,{"$f":"SUM(G29:G32)","v":0}]
[null,"di cui:","(A2.2a) Finanziamenti diretti selezionati da una banca o da un intermediario finanziario ed in possesso di  tutte le caratteristiche sulla qualità dei prenditori e sul rapporto con l’intermediario (voce 553)",null,null,138,0]
[null,"di cui:","(A2.2b) Finanziamenti diretti selezionati da una banca o da un intermediario finanziario ma non in possesso delle sole caratteristiche relative al prenditore di finanziamenti (voce 557)",null,null,139,0]
[null,"di cui:","(A2.2c) Finanziamenti diretti selezionati da una banca o da un intermediario finanziario ma non in possesso delle caratteristiche relative al prenditore di finanziamenti e del rapporto con l’intermediario (voce 561)",null,null,140,0]
[null,"di cui:","A2.2d) Finanziamenti diretti non selezionati da una banca o da un intermediario finanziario (voce 565)",null,null,141,0]
[null,"(A.3.1a) Azioni negoziate in un mercato regolament. (voce 65)",{"$nulls":3},6,0]
[null,"(A.3.1.b) Azioni non negoz. in un mercato regolam. (voce 69)",{"$nulls":3},7,0]
[null,"(A.3.3) Quote di OICVM italiani e UE (voce 77)",{"$nulls":3},8,0]
[null,"(A.3.4) Quote di FIA chiusi negoziate in un mercato regolamentato (voce 81)",{"$nulls":3},101,0]
[null,"(A.4.1, A.4.2, A.4.3) Comparto immobiliare, al netto delle quote di quote di FIA immobiliari italiani (voci 89+93+97)",{"$nulls":3},102,0]
[null,"(A.4.4) Quote di FIA immobiliari italiani (voce 101)",{"$nulls":3},103,0]
[null,"(A.5.1a) Quote di FIA italiani e UE aperti che investono preval. nel comparto obbligazionario (voce 301)",{"$nulls":3},104,0]
[null,"(A.5.1b) Quote di FIA italiani e UE aperti che investono preval. nel comparto azionario (voce 305) ",{"$nulls":3},105,0]
[null,"(A.5.2a, A.5.2b) Quote di FIA italiani e UE chiusi non negoziate in un mercato regolamentato ed in Fia italiani riservati nonché quote di altri FIA italiani e UE aperti diversi dalle classi precedenti (voci 309+313)",{"$nulls":3},24,0]
[null,"(B.1, B.2, B.3.1, B.3.2, B.4) Crediti tecnici (voci 117+121+125+129+133)",{"$nulls":3},10,0]
[null,"(B.5) Crediti di imposta (voce 137) ",{"$nulls":3},{"$f":"F42+1","v":11},0]
[null,"(B.6) Crediti verso fondi di garanzia al netto delle partite debitorie  (voce 141)",{"$nulls":3},26,0]
[null,"(B.7) Crediti derivanti da operazioni di gestione accentrata della tesoreria di gruppo vantati nei confronti della società incaricata della gestione stessa (voce 401)",{"$nulls":3},107,0]
[null,"(D) Depositi bancari (voce 181) ",{"$nulls":3},12,0]
[null,"(C.1, C.2, C.3, C.4, C.5) Altri attivi (voci 149+153+161+165+169)",{"$nulls":3},27,0]
[null,"(E) Altre categorie di attivo autorizzate dall'ISVAP (voce 185)",{"$nulls":3},14,0]
[null,"Titoli di debito emessi o garantiti da Stati membri dell'Unione Europea compresi nelle classi A.1.1a e A.1.1b",{"$nulls":3},119,0,122,0]
[null,"di cui: ","Titoli di debito emessi o garantiti da Stati membri dell'Unione Europea compresi nelle classi A.1.1a e A.1.1b per i quali è stata esercitata la facoltà di cui all'art. 4, comma 1, del Regolamento ISVAP n. 43",null,null,120,0,123,0]
[]
[]
[]
["(*) Tra parentesi sono riportate sia l'indicazione delle classi di attivi a copertura delle riserve tecniche da aggregare che i corrispondenti numeri delle voci indicate nel Modello 1 “Prospetto dimostrativo delle attività assegnate alla copertura delle riserve tecniche dei rami vita da allegare al bilancio di esercizio” di cui all’Allegato 4 al Regolamento ISVAP n. 36 del 31 gennaio 2011, come da ultimo modificato e integrato dal Provvedimento IVASS n. 22 del 21 ottobre 2014, Allegato C"]
[{"$nulls":4},"Segue Prospetto 7.2"]
["Copertura delle riserve tecniche relative ai contratti di cui all'art. 41, commi 1 e 2, del d.lgs. n. 209/05 e derivanti dalla gestione dei fondi pensione di cui alla classe D.II dello Stato Patrimoniale  - Portafoglio diretto italiano"]
[{"$nulls":6},"(Valori in migliaia di Euro)"]
[{"$nulls":3},"Riserve tecniche da coprire",null,"Attivi a copertura"]
["Contratti collegati al valore delle quote di un OICR",null,null,15,0,19,0]
["Contratti collegati al valore delle quote di fondi interni",null,null,16,0,20,0]
["Contratti collegati ad indici azionari o altri valori di riferimento",null,null,17,0,21,0]
["Gestione dei fondi pensione",null,null,18,0,22,0]
[]
[]
[]
[null,null,"Attivi del patrimonio libero di cui all'art. 6, comma 2, del Regolamento ISVAP n. 43, di ammontare pari alla differenza generata dall'esercizio della facoltà di cui all'articolo 4, comma 1, del Regolamento 43 medesimo, relativa agli attivi a copertura delle riserve tecniche (ex art. 36 e 41, comma 4, d.lgs. n. 209/05) "]
[]
[]
[null,"Attivi",null,"Valori di bilancio al\n31 dicembre 2015"]
[null,"Totale attivi",null,124,{"$f":"G50-I50","v":0}]
[null,null,"di cui: Attivi idonei alla copertura delle riserve tecniche",125,0]

{"sheet":"Foglio2","index":16,"n_rows":1177,"n_cols":6,"rows_kept":1177,"hidden":true}
["CHIAVE","Indirizzo\nCella","Nome\nProspetto","Ha formula"]
["1000100","$I$7","Prospetto 1",false,"prospetto 1'!$I$7",{"$f":"'prospetto 1'!$I$7","v":0}]
["1000200","$I$8","Prospetto 1",false,"prospetto 1'!$I$8",{"$f":"'prospetto 1'!$I$8","v":0}]
["1004100","$I$9","Prospetto 1",false,"prospetto 1'!$I$9",{"$f":"'prospetto 1'!$I$9","v":0}]
["1000300","$I$10","Prospetto 1",false,"prospetto 1'!$I$10",{"$f":"'prospetto 1'!$I$10","v":0}]
["1000400","$I$11","Prospetto 1",false,"prospetto 1'!$I$11",{"$f":"'prospetto 1'!$I$11","v":0}]
["1000500","$I$12","Prospetto 1",false,"prospetto 1'!$I$12",{"$f":"'prospetto 1'!$I$12","v":0}]
["1000600","$I$13","Prospetto 1",false,"prospetto 1'!$I$13",{"$f":"'prospetto 1'!$I$13","v":0}]
["1004200","$I$14","Prospetto 1",false,"prospetto 1'!$I$14",{"$f":"'prospetto 1'!$I$14","v":0}]
["1000700","$I$15","Prospetto 1",false,"prospetto 1'!$I$15",{"$f":"'prospetto 1'!$I$15","v":0}]
["1000800","$I$16","Prospetto 1",false,"prospetto 1'!$I$16",{"$f":"'prospetto 1'!$I$16","v":0}]
["1000900","$I$17","Prospetto 1",false,"prospetto 1'!$I$17",{"$f":"'prospetto 1'!$I$17","v":0}]
["1004300","$I$18","Prospetto 1",false,"prospetto 1'!$I$18",{"$f":"'prospetto 1'!$I$18","v":0}]
["1001400","$I$19","Prospetto 1",false,"prospetto 1'!$I$19",{"$f":"'prospetto 1'!$I$19","v":0}]
["1001500","$I$20","Prospetto 1",false,"prospetto 1'!$I$20",{"$f":"'prospetto 1'!$I$20","v":0}]
["1001600","$I$21","Prospetto 1",false,"prospetto 1'!$I$21",{"$f":"'prospetto 1'!$I$21","v":0}]
["1004400","$I$22","Prospetto 1",false,"prospetto 1'!$I$22",{"$f":"'prospetto 1'!$I$22","v":0}]
["1004500","$I$23","Prospetto 1",false,"prospetto 1'!$I$23",{"$f":"'prospetto 1'!$I$23","v":0}]
["1001700","$I$24","Prospetto 1",false,"prospetto 1'!$I$24",{"$f":"'prospetto 1'!$I$24","v":0}]
["1004600","$I$25","Prospetto 1",false,"prospetto 1'!$I$25",{"$f":"'prospetto 1'!$I$25","v":0}]
["1004700","$I$26","Prospetto 1",false,"prospetto 1'!$I$26",{"$f":"'prospetto 1'!$I$26","v":0}]
["1008400","$I$27","Prospetto 1",false,"prospetto 1'!$I$27",{"$f":"'prospetto 1'!$I$27","v":0}]
["1008500","$I$28","Prospetto 1",false,"prospetto 1'!$I$28",{"$f":"'prospetto 1'!$I$28","v":0}]
["1008600","$I$29","Prospetto 1",false,"prospetto 1'!$I$29",{"$f":"'prospetto 1'!$I$29","v":0}]
["1001800","$I$30","Prospetto 1",false,"prospetto 1'!$I$30",{"$f":"'prospetto 1'!$I$30","v":0}]
["1004800","$I$31","Prospetto 1",false,"prospetto 1'!$I$31",{"$f":"'prospetto 1'!$I$31","v":0}]
["1004900","$I$32","Prospetto 1",false,"prospetto 1'!$I$32",{"$f":"'prospetto 1'!$I$32","v":0}]
["1005000","$I$33","Prospetto 1",false,"prospetto 1'!$I$33",{"$f":"'prospetto 1'!$I$33","v":0}]
["1002200","$I$34","Prospetto 1",true,"prospetto 1'!$I$34",{"$f":"'prospetto 1'!$I$34","v":0}]
["1002300","$I$35","Prospetto 1",true,"prospetto 1'!$I$35",{"$f":"'prospetto 1'!$I$35","v":0}]
["1002400","$I$36","Prospetto 1",false,"prospetto 1'!$I$36",{"$f":"'prospetto 1'!$I$36","v":0}]
["1002500","$I$37","Prospetto 1",false,"prospetto 1'!$I$37",{"$f":"'prospetto 1'!$I$37","v":0}]
["1002600","$I$38","Prospetto 1",true,"prospetto 1'!$I$38",{"$f":"'prospetto 1'!$I$38","v":0}]
["1002700","$I$39","Prospetto 1",false,"prospetto 1'!$I$39",{"$f":"'prospetto 1'!$I$39","v":0}]
["1002800","$I$40","Prospetto 1",false,"prospetto 1'!$I$40",{"$f":"'prospetto 1'!$I$40","v":0}]
["1002900","$I$41","Prospetto 1",false,"prospetto 1'!$I$41",{"$f":"'prospetto 1'!$I$41","v":0}]
["1003000","$I$42","Prospetto 1",false,"prospetto 1'!$I$42",{"$f":"'prospetto 1'!$I$42","v":0}]
["1003100","$I$43","Prospetto 1",false,"prospetto 1'!$I$43",{"$f":"'prospetto 1'!$I$43","v":0}]
["1003200","$I$44","Prospetto 1",false,"prospetto 1'!$I$44",{"$f":"'prospetto 1'!$I$44","v":0}]
["1003300","$I$45","Prospetto 1",false,"prospetto 1'!$I$45",{"$f":"'prospetto 1'!$I$45","v":0}]
["1003400","$I$46","Prospetto 1",false,"prospetto 1'!$I$46",{"$f":"'prospetto 1'!$I$46","v":0}]
["1005100","$I$49","Prospetto 1",false,"prospetto 1'!$I$49",{"$f":"'prospetto 1'!$I$49","v":0}]
["1003500","$I$50","Prospetto 1",false,"prospetto 1'!$I$50",{"$f":"'prospetto 1'!$I$50","v":0}]
["1003600","$I$51","Prospetto 1",false,"prospetto 1'!$I$51",{"$f":"'prospetto 1'!$I$51","v":0}]
["1003700","$I$52","Prospetto 1",false,"prospetto 1'!$I$52",{"$f":"'prospetto 1'!$I$52","v":0}]
["1003800","$I$53","Prospetto 1",false,"prospetto 1'!$I$53",{"$f":"'prospetto 1'!$I$53","v":0}]
["1003900","$I$54","Prospetto 1",false,"prospetto 1'!$I$54",{"$f":"'prospetto 1'!$I$54","v":0}]
["1005200","$I$55","Prospetto 1",false,"prospetto 1'!$I$55",{"$f":"'prospetto 1'!$I$55","v":0}]
["1004000","$I$56","Prospetto 1",false,"prospetto 1'!$I$56",{"$f":"'prospetto 1'!$I$56","v":0}]
["1006800","$I$57","Prospetto 1",false,"prospetto 1'!$I$57",{"$f":"'prospetto 1'!$I$57","v":0}]
["1006900","$I$58","Prospetto 1",false,"prospetto 1'!$I$58",{"$f":"'prospetto 1'!$I$58","v":0}]
["1005400","$E$75","Prospetto 1",false,"prospetto 1'!$E$75",{"$f":"'prospetto 1'!$E$75","v":0}]
["1005500","$E$78","Prospetto 1",false,"prospetto 1'!$E$78",{"$f":"'prospetto 1'!$E$78","v":0}]
["1005600","$E$82","Prospetto 1",false,"prospetto 1'!$E$82",{"$f":"'prospetto 1'!$E$82","v":0}]
["1005700","$E$84","Prospetto 1",false,"prospetto 1'!$E$84",{"$f":"'prospetto 1'!$E$84","v":0}]
["1005800","$E$86","Prospetto 1",false,"prospetto 1'!$E$86",{"$f":"'prospetto 1'!$E$86","v":0}]
["1005900","$E$89","Prospetto 1",false,"prospetto 1'!$E$89",{"$f":"'prospetto 1'!$E$89","v":0}]
["1005300","$G$70","Prospetto 1",false,"prospetto 1'!$G$70",{"$f":"'prospetto 1'!$G$70","v":0}]
["1011200","$E$95","Prospetto 1",false,"prospetto 1'!$E$95",{"$f":"'prospetto 1'!$E$95","v":0}]
["1011300","$I$95","Prospetto 1",false,"prospetto 1'!$I$95",{"$f":"'prospetto 1'!$I$95","v":0}]
["2000100","$I$7","Prospetto 2",false,"prospetto 2'!$I$7",{"$f":"'prospetto 2'!$I$7","v":0}]
["2000200","$I$8","Prospetto 2",false,"prospetto 2'!$I$8",{"$f":"'prospetto 2'!$I$8","v":0}]
["2003500","$I$9","Prospetto 2",false,"prospetto 2'!$I$9",{"$f":"'prospetto 2'!$I$9","v":0}]
["2000300","$I$10","Prospetto 2",false,"prospetto 2'!$I$10",{"$f":"'prospetto 2'!$I$10","v":0}]
["2000400","$I$11","Prospetto 2",false,"prospetto 2'!$I$11",{"$f":"'prospetto 2'!$I$11","v":0}]
["2000500","$I$12","Prospetto 2",false,"prospetto 2'!$I$12",{"$f":"'prospetto 2'!$I$12","v":0}]
["2000600","$I$13","Prospetto 2",false,"prospetto 2'!$I$13",{"$f":"'prospetto 2'!$I$13","v":0}]
["2003600","$I$14","Prospetto 2",false,"prospetto 2'!$I$14",{"$f":"'prospetto 2'!$I$14","v":0}]
["2001000","$I$15","Prospetto 2",false,"prospetto 2'!$I$15",{"$f":"'prospetto 2'!$I$15","v":0}]
["2003700","$I$16","Prospetto 2",false,"prospetto 2'!$I$16",{"$f":"'prospetto 2'!$I$16","v":0}]
["2001100","$I$17","Prospetto 2",true,"prospetto 2'!$I$17",{"$f":"'prospetto 2'!$I$17","v":0}]
["2001200","$I$18","Prospetto 2",false,"prospetto 2'!$I$18",{"$f":"'prospetto 2'!$I$18","v":0}]
["2001300","$I$19","Prospetto 2",false,"prospetto 2'!$I$19",{"$f":"'prospetto 2'!$I$19","v":0}]
["2003800","$I$20","Prospetto 2",false,"prospetto 2'!$I$20",{"$f":"'prospetto 2'!$I$20","v":0}]
["2001400","$I$21","Prospetto 2",false,"prospetto 2'!$I$21",{"$f":"'prospetto 2'!$I$21","v":0}]
["2001500","$I$22","Prospetto 2",false,"prospetto 2'!$I$22",{"$f":"'prospetto 2'!$I$22","v":0}]
["2001600","$I$23","Prospetto 2",false,"prospetto 2'!$I$23",{"$f":"'prospetto 2'!$I$23","v":0}]
["2003900","$I$24","Prospetto 2",false,"prospetto 2'!$I$24",{"$f":"'prospetto 2'!$I$24","v":0}]
["2004000","$I$25","Prospetto 2",false,"prospetto 2'!$I$25",{"$f":"'prospetto 2'!$I$25","v":0}]
["2001700","$I$26","Prospetto 2",false,"prospetto 2'!$I$26",{"$f":"'prospetto 2'!$I$26","v":0}]
["2004100","$I$27","Prospetto 2",false,"prospetto 2'!$I$27",{"$f":"'prospetto 2'!$I$27","v":0}]
["2007900","$I$28","Prospetto 2",false,"prospetto 2'!$I$28",{"$f":"'prospetto 2'!$I$28","v":0}]
["2008000","$I$29","Prospetto 2",false,"prospetto 2'!$I$29",{"$f":"'prospetto 2'!$I$29","v":0}]
["2008100","$I$30","Prospetto 2",false,"prospetto 2'!$I$30",{"$f":"'prospetto 2'!$I$30","v":0}]
["2004200","$I$31","Prospetto 2",false,"prospetto 2'!$I$31",{"$f":"'prospetto 2'!$I$31","v":0}]
["2001800","$I$32","Prospetto 2",false,"prospetto 2'!$I$32",{"$f":"'prospetto 2'!$I$32","v":0}]
["2004300","$I$33","Prospetto 2",false,"prospetto 2'!$I$33",{"$f":"'prospetto 2'!$I$33","v":0}]
["2004400","$I$34","Prospetto 2",false,"prospetto 2'!$I$34",{"$f":"'prospetto 2'!$I$34","v":0}]
["2001900","$I$35","Prospetto 2",false,"prospetto 2'!$I$35",{"$f":"'prospetto 2'!$I$35","v":0}]
["2002000","$I$36","Prospetto 2",false,"prospetto 2'!$I$36",{"$f":"'prospetto 2'!$I$36","v":0}]
["2002100","$I$37","Prospetto 2",true,"prospetto 2'!$I$37",{"$f":"'prospetto 2'!$I$37","v":0}]
["2004500","$I$38","Prospetto 2",false,"prospetto 2'!$I$38",{"$f":"'prospetto 2'!$I$38","v":0}]
["2002200","$I$39","Prospetto 2",true,"prospetto 2'!$I$39",{"$f":"'prospetto 2'!$I$39","v":0}]
["2002300","$I$40","Prospetto 2",true,"prospetto 2'!$I$40",{"$f":"'prospetto 2'!$I$40","v":0}]
["2002400","$I$41","Prospetto 2",false,"prospetto 2'!$I$41",{"$f":"'prospetto 2'!$I$41","v":0}]
["2002500","$I$42","Prospetto 2",false,"prospetto 2'!$I$42",{"$f":"'prospetto 2'!$I$42","v":0}]
["2002600","$I$43","Prospetto 2",true,"prospetto 2'!$I$43",{"$f":"'prospetto 2'!$I$43","v":0}]
["2002700","$I$44","Prospetto 2",false,"prospetto 2'!$I$44",{"$f":"'prospetto 2'!$I$44","v":0}]
["2002800","$I$45","Prospetto 2",false,"prospetto 2'!$I$45",{"$f":"'prospetto 2'!$I$45","v":0}]
["2002900","$I$46","Prospetto 2",false,"prospetto 2'!$I$46",{"$f":"'prospetto 2'!$I$46","v":0}]
["2003000","$I$47","Prospetto 2",false,"prospetto 2'!$I$47",{"$f":"'prospetto 2'!$I$47","v":0}]
["2004600","$I$48","Prospetto 2",false,"prospetto 2'!$I$48",{"$f":"'prospetto 2'!$I$48","v":0}]
["2003100","$I$49","Prospetto 2",false,"prospetto 2'!$I$49",{"$f":"'prospetto 2'!$I$49","v":0}]
["2003200","$I$50","Prospetto 2",false,"prospetto 2'!$I$50",{"$f":"'prospetto 2'!$I$50","v":0}]
["2003300","$I$51","Prospetto 2",false,"prospetto 2'!$I$51",{"$f":"'prospetto 2'!$I$51","v":0}]
["2003400","$I$52","Prospetto 2",false,"prospetto 2'!$I$52",{"$f":"'prospetto 2'!$I$52","v":0}]
["2004700","$G$65","Prospetto 2",false,"prospetto 2'!$G$65",{"$f":"'prospetto 2'!$G$65","v":0}]
["2004800","$E$69","Prospetto 2",false,"prospetto 2'!$E$69",{"$f":"'prospetto 2'!$E$69","v":0}]
["2004900","$E$72","Prospetto 2",false,"prospetto 2'!$E$72",{"$f":"'prospetto 2'!$E$72","v":0}]
["2005000","$E$76","Prospetto 2",false,"prospetto 2'!$E$76",{"$f":"'prospetto 2'!$E$76","v":0}]
["2005100","$E$78","Prospetto 2",false,"prospetto 2'!$E$78",{"$f":"'prospetto 2'!$E$78","v":0}]
["2005200","$E$80","Prospetto 2",false,"prospetto 2'!$E$80",{"$f":"'prospetto 2'!$E$80","v":0}]
["2005300","$E$83","Prospetto 2",false,"prospetto 2'!$E$83",{"$f":"'prospetto 2'!$E$83","v":0}]
["2006200","$E$89","Prospetto 2",false,"prospetto 2'!$E$89",{"$f":"'prospetto 2'!$E$89","v":0}]
["2006300","$I$89","Prospetto 2",false,"prospetto 2'!$I$89",{"$f":"'prospetto 2'!$I$89","v":0}]
["4100100","$I$11","Prospetto 4.1",false,"prospetto 4.1'!$I$11",{"$f":"'prospetto 4.1'!$I$11","v":0}]
["4100200","$I$12","Prospetto 4.1",false,"prospetto 4.1'!$I$12",{"$f":"'prospetto 4.1'!$I$12","v":0}]
["4100300","$I$13","Prospetto 4.1",false,"prospetto 4.1'!$I$13",{"$f":"'prospetto 4.1'!$I$13","v":0}]
["4100400","$I$14","Prospetto 4.1",false,"prospetto 4.1'!$I$14",{"$f":"'prospetto 4.1'!$I$14","v":0}]
["4100500","$I$15","Prospetto 4.1",false,"prospetto 4.1'!$I$15",{"$f":"'prospetto 4.1'!$I$15","v":0}]
["4100600","$I$16","Prospetto 4.1",false,"prospetto 4.1'!$I$16",{"$f":"'prospetto 4.1'!$I$16","v":0}]
["4100700","$I$17","Prospetto 4.1",false,"prospetto 4.1'!$I$17",{"$f":"'prospetto 4.1'!$I$17","v":0}]
["4100800","$I$18","Prospetto 4.1",true,"prospetto 4.1'!$I$18",{"$f":"'prospetto 4.1'!$I$18","v":0}]
["4100900","$I$20","Prospetto 4.1",false,"prospetto 4.1'!$I$20",{"$f":"'prospetto 4.1'!$I$20","v":0}]
["4101000","$I$21","Prospetto 4.1",false,"prospetto 4.1'!$I$21",{"$f":"'prospetto 4.1'!$I$21","v":0}]
["4101100","$I$22","Prospetto 4.1",false,"prospetto 4.1'!$I$22",{"$f":"'prospetto 4.1'!$I$22","v":0}]
["4101200","$I$23","Prospetto 4.1",true,"prospetto 4.1'!$I$23",{"$f":"'prospetto 4.1'!$I$23","v":0}]
["4101300","$I$25","Prospetto 4.1",false,"prospetto 4.1'!$I$25",{"$f":"'prospetto 4.1'!$I$25","v":0}]
["4101400","$I$26","Prospetto 4.1",false,"prospetto 4.1'!$I$26",{"$f":"'prospetto 4.1'!$I$26","v":0}]
["4101500","$I$28","Prospetto 4.1",false,"prospetto 4.1'!$I$28",{"$f":"'prospetto 4.1'!$I$28","v":0}]
["4101600","$F$33","Prospetto 4.1",false,"prospetto 4.1'!$F$33",{"$f":"'prospetto 4.1'!$F$33","v":0}]
["4200100","$I$11","Prospetto 4.2",false,"prospetto 4.2'!$I$11",{"$f":"'prospetto 4.2'!$I$11","v":0}]
["4201700","$I$12","Prospetto 4.2",false,"prospetto 4.2'!$I$12",{"$f":"'prospetto 4.2'!$I$12","v":0}]
["4201800","$I$13","Prospetto 4.2",false,"prospetto 4.2'!$I$13",{"$f":"'prospetto 4.2'!$I$13","v":0}]
["4200300","$I$15","Prospetto 4.2",false,"prospetto 4.2'!$I$15",{"$f":"'prospetto 4.2'!$I$15","v":0}]
["4200400","$I$16","Prospetto 4.2",false,"prospetto 4.2'!$I$16",{"$f":"'prospetto 4.2'!$I$16","v":0}]
["4200500","$I$17","Prospetto 4.2",false,"prospetto 4.2'!$I$17",{"$f":"'prospetto 4.2'!$I$17","v":0}]
["4200600","$I$18","Prospetto 4.2",false,"prospetto 4.2'!$I$18",{"$f":"'prospetto 4.2'!$I$18","v":0}]
["4200700","$I$19","Prospetto 4.2",false,"prospetto 4.2'!$I$19",{"$f":"'prospetto 4.2'!$I$19","v":0}]
["4200800","$I$20","Prospetto 4.2",false,"prospetto 4.2'!$I$20",{"$f":"'prospetto 4.2'!$I$20","v":0}]
["4200900","$I$21","Prospetto 4.2",false,"prospetto 4.2'!$I$21",{"$f":"'prospetto 4.2'!$I$21","v":0}]
["4201000","$I$22","Prospetto 4.2",true,"prospetto 4.2'!$I$22",{"$f":"'prospetto 4.2'!$I$22","v":0}]
["4201100","$I$24","Prospetto 4.2",false,"prospetto 4.2'!$I$24",{"$f":"'prospetto 4.2'!$I$24","v":0}]
["4201200","$I$25","Prospetto 4.2",false,"prospetto 4.2'!$I$25",{"$f":"'prospetto 4.2'!$I$25","v":0}]
["4201300","$I$26","Prospetto 4.2",true,"prospetto 4.2'!$I$26",{"$f":"'prospetto 4.2'!$I$26","v":0}]
["4201400","$I$28","Prospetto 4.2",false,"prospetto 4.2'!$I$28",{"$f":"'prospetto 4.2'!$I$28","v":0}]
["4201500","$I$29","Prospetto 4.2",false,"prospetto 4.2'!$I$29",{"$f":"'prospetto 4.2'!$I$29","v":0}]
["4201600","$I$31","Prospetto 4.2",false,"prospetto 4.2'!$I$31",{"$f":"'prospetto 4.2'!$I$31","v":0}]
["4201900","$F$34","Prospetto 4.2",false,"prospetto 4.2'!$F$34",{"$f":"'prospetto 4.2'!$F$34","v":0}]
["4202000","$F$37","Prospetto 4.2",false,"prospetto 4.2'!$F$37",{"$f":"'prospetto 4.2'!$F$37","v":0}]
["4202100","$F$39","Prospetto 4.2",false,"prospetto 4.2'!$F$39",{"$f":"'prospetto 4.2'!$F$39","v":0}]
["4202200","$F$41","Prospetto 4.2",false,"prospetto 4.2'!$F$41",{"$f":"'prospetto 4.2'!$F$41","v":0}]
["5000101","$H$10","Prospetto 5",false,"prospetto 5'!$H$10",{"$f":"'prospetto 5'!$H$10","v":0}]
["5003201","$H$11","Prospetto 5",false,"prospetto 5'!$H$11",{"$f":"'prospetto 5'!$H$11","v":0}]
["5000201","$H$12","Prospetto 5",false,"prospetto 5'!$H$12",{"$f":"'prospetto 5'!$H$12","v":0}]
["5000301","$H$13","Prospetto 5",false,"prospetto 5'!$H$13",{"$f":"'prospetto 5'!$H$13","v":0}]
["5003101","$H$14","Prospetto 5",false,"prospetto 5'!$H$14",{"$f":"'prospetto 5'!$H$14","v":0}]
["5000401","$H$15","Prospetto 5",false,"prospetto 5'!$H$15",{"$f":"'prospetto 5'!$H$15","v":0}]
["5000501","$H$16","Prospetto 5",false,"prospetto 5'!$H$16",{"$f":"'prospetto 5'!$H$16","v":0}]
["5000601","$H$17","Prospetto 5",false,"prospetto 5'!$H$17",{"$f":"'prospetto 5'!$H$17","v":0}]
["5000701","$H$18","Prospetto 5",true,"prospetto 5'!$H$18",{"$f":"'prospetto 5'!$H$18","v":0}]
["5000801","$H$19","Prospetto 5",false,"prospetto 5'!$H$19",{"$f":"'prospetto 5'!$H$19","v":0}]
["5000901","$H$20","Prospetto 5",false,"prospetto 5'!$H$20",{"$f":"'prospetto 5'!$H$20","v":0}]
["5001001","$H$21","Prospetto 5",false,"prospetto 5'!$H$21",{"$f":"'prospetto 5'!$H$21","v":0}]
["5001101","$H$22","Prospetto 5",false,"prospetto 5'!$H$22",{"$f":"'prospetto 5'!$H$22","v":0}]
["5001201","$H$23","Prospetto 5",false,"prospetto 5'!$H$23",{"$f":"'prospetto 5'!$H$23","v":0}]
["5000102","$L$10","Prospetto 5",false,"prospetto 5'!$L$10",{"$f":"'prospetto 5'!$L$10","v":0}]
["5003202","$L$11","Prospetto 5",false,"prospetto 5'!$L$11",{"$f":"'prospetto 5'!$L$11","v":0}]
["5000202","$L$12","Prospetto 5",false,"prospetto 5'!$L$12",{"$f":"'prospetto 5'!$L$12","v":0}]
["5000302","$L$13","Prospetto 5",false,"prospetto 5'!$L$13",{"$f":"'prospetto 5'!$L$13","v":0}]
["5003102","$L$14","Prospetto 5",false,"prospetto 5'!$L$14",{"$f":"'prospetto 5'!$L$14","v":0}]
["5000402","$L$15","Prospetto 5",false,"prospetto 5'!$L$15",{"$f":"'prospetto 5'!$L$15","v":0}]
["5000502","$L$16","Prospetto 5",false,"prospetto 5'!$L$16",{"$f":"'prospetto 5'!$L$16","v":0}]
["5000602","$L$17","Prospetto 5",false,"prospetto 5'!$L$17",{"$f":"'prospetto 5'!$L$17","v":0}]
["5000702","$L$18","Prospetto 5",true,"prospetto 5'!$L$18",{"$f":"'prospetto 5'!$L$18","v":0}]
["5000802","$L$19","Prospetto 5",false,"prospetto 5'!$L$19",{"$f":"'prospetto 5'!$L$19","v":0}]
["5000902","$L$20","Prospetto 5",false,"prospetto 5'!$L$20",{"$f":"'prospetto 5'!$L$20","v":0}]
["5001002","$L$21","Prospetto 5",false,"prospetto 5'!$L$21",{"$f":"'prospetto 5'!$L$21","v":0}]
["5001102","$L$22","Prospetto 5",false,"prospetto 5'!$L$22",{"$f":"'prospetto 5'!$L$22","v":0}]
["5001202","$L$23","Prospetto 5",false,"prospetto 5'!$L$23",{"$f":"'prospetto 5'!$L$23","v":0}]
["5000103","$P$10","Prospetto 5",false,"prospetto 5'!$P$10",{"$f":"'prospetto 5'!$P$10","v":0}]
["5003203","$P$11","Prospetto 5",false,"prospetto 5'!$P$11",{"$f":"'prospetto 5'!$P$11","v":0}]
["5000203","$P$12","Prospetto 5",false,"prospetto 5'!$P$12",{"$f":"'prospetto 5'!$P$12","v":0}]
["5000303","$P$13","Prospetto 5",false,"prospetto 5'!$P$13",{"$f":"'prospetto 5'!$P$13","v":0}]
["5003103","$P$14","Prospetto 5",false,"prospetto 5'!$P$14",{"$f":"'prospetto 5'!$P$14","v":0}]
["5000403","$P$15","Prospetto 5",false,"prospetto 5'!$P$15",{"$f":"'prospetto 5'!$P$15","v":0}]
["5000503","$P$16","Prospetto 5",false,"prospetto 5'!$P$16",{"$f":"'prospetto 5'!$P$16","v":0}]
["5000603","$P$17","Prospetto 5",false,"prospetto 5'!$P$17",{"$f":"'prospetto 5'!$P$17","v":0}]
["5000703","$P$18","Prospetto 5",true,"prospetto 5'!$P$18",{"$f":"'prospetto 5'!$P$18","v":0}]
["5000803","$P$19","Prospetto 5",false,"prospetto 5'!$P$19",{"$f":"'prospetto 5'!$P$19","v":0}]
["5000903","$P$20","Prospetto 5",false,"prospetto 5'!$P$20",{"$f":"'prospetto 5'!$P$20","v":0}]
["5001003","$P$21","Prospetto 5",false,"prospetto 5'!$P$21",{"$f":"'prospetto 5'!$P$21","v":0}]
["5001103","$P$22","Prospetto 5",false,"prospetto 5'!$P$22",{"$f":"'prospetto 5'!$P$22","v":0}]
["5001203","$P$23","Prospetto 5",false,"prospetto 5'!$P$23",{"$f":"'prospetto 5'!$P$23","v":0}]
["5000104","$T$10","Prospetto 5",false,"prospetto 5'!$T$10",{"$f":"'prospetto 5'!$T$10","v":0}]
["5003204","$T$11","Prospetto 5",false,"prospetto 5'!$T$11",{"$f":"'prospetto 5'!$T$11","v":0}]
["5000204","$T$12","Prospetto 5",false,"prospetto 5'!$T$12",{"$f":"'prospetto 5'!$T$12","v":0}]
["5000304","$T$13","Prospetto 5",false,"prospetto 5'!$T$13",{"$f":"'prospetto 5'!$T$13","v":0}]
["5003104","$T$14","Prospetto 5",false,"prospetto 5'!$T$14",{"$f":"'prospetto 5'!$T$14","v":0}]
["5000404","$T$15","Prospetto 5",false,"prospetto 5'!$T$15",{"$f":"'prospetto 5'!$T$15","v":0}]
["5000504","$T$16","Prospetto 5",false,"prospetto 5'!$T$16",{"$f":"'prospetto 5'!$T$16","v":0}]
["5000604","$T$17","Prospetto 5",false,"prospetto 5'!$T$17",{"$f":"'prospetto 5'!$T$17","v":0}]
["5000704","$T$18","Prospetto 5",true,"prospetto 5'!$T$18",{"$f":"'prospetto 5'!$T$18","v":0}]
["5000804","$T$19","Prospetto 5",false,"prospetto 5'!$T$19",{"$f":"'prospetto 5'!$T$19","v":0}]
["5000904","$T$20","Prospetto 5",false,"prospetto 5'!$T$20",{"$f":"'prospetto 5'!$T$20","v":0}]
["5001004","$T$21","Prospetto 5",false,"prospetto 5'!$T$21",{"$f":"'prospetto 5'!$T$21","v":0}]
["5001104","$T$22","Prospetto 5",false,"prospetto 5'!$T$22",{"$f":"'prospetto 5'!$T$22","v":0}]
["5001204","$T$23","Prospetto 5",false,"prospetto 5'!$T$23",{"$f":"'prospetto 5'!$T$23","v":0}]
["5000105","$X$10","Prospetto 5",false,"prospetto 5'!$X$10",{"$f":"'prospetto 5'!$X$10","v":0}]
["5003205","$X$11","Prospetto 5",false,"prospetto 5'!$X$11",{"$f":"'prospetto 5'!$X$11","v":0}]
["5000205","$X$12","Prospetto 5",false,"prospetto 5'!$X$12",{"$f":"'prospetto 5'!$X$12","v":0}]
["5000305","$X$13","Prospetto 5",false,"prospetto 5'!$X$13",{"$f":"'prospetto 5'!$X$13","v":0}]
["5003105","$X$14","Prospetto 5",false,"prospetto 5'!$X$14",{"$f":"'prospetto 5'!$X$14","v":0}]
["5000405","$X$15","Prospetto 5",false,"prospetto 5'!$X$15",{"$f":"'prospetto 5'!$X$15","v":0}]
["5000505","$X$16","Prospetto 5",false,"prospetto 5'!$X$16",{"$f":"'prospetto 5'!$X$16","v":0}]
["5000605","$X$17","Prospetto 5",false,"prospetto 5'!$X$17",{"$f":"'prospetto 5'!$X$17","v":0}]
["5000705","$X$18","Prospetto 5",true,"prospetto 5'!$X$18",{"$f":"'prospetto 5'!$X$18","v":0}]
["5000805","$X$19","Prospetto 5",false,"prospetto 5'!$X$19",{"$f":"'prospetto 5'!$X$19","v":0}]
["5000905","$X$20","Prospetto 5",false,"prospetto 5'!$X$20",{"$f":"'prospetto 5'!$X$20","v":0}]
["5001005","$X$21","Prospetto 5",false,"prospetto 5'!$X$21",{"$f":"'prospetto 5'!$X$21","v":0}]
["5001105","$X$22","Prospetto 5",false,"prospetto 5'!$X$22",{"$f":"'prospetto 5'!$X$22","v":0}]
["5001205","$X$23","Prospetto 5",false,"prospetto 5'!$X$23",{"$f":"'prospetto 5'!$X$23","v":0}]
["5000106","$AB$10","Prospetto 5",false,"prospetto 5'!$AB$10",{"$f":"'prospetto 5'!$AB$10","v":0}]
["5003206","$AB$11","Prospetto 5",false,"prospetto 5'!$AB$11",{"$f":"'prospetto 5'!$AB$11","v":0}]
["5000206","$AB$12","Prospetto 5",false,"prospetto 5'!$AB$12",{"$f":"'prospetto 5'!$AB$12","v":0}]
["5000306","$AB$13","Prospetto 5",false,"prospetto 5'!$AB$13",{"$f":"'prospetto 5'!$AB$13","v":0}]
["5003106","$AB$14","Prospetto 5",false,"prospetto 5'!$AB$14",{"$f":"'prospetto 5'!$AB$14","v":0}]
["5000406","$AB$15","Prospetto 5",false,"prospetto 5'!$AB$15",{"$f":"'prospetto 5'!$AB$15","v":0}]
["5000506","$AB$16","Prospetto 5",false,"prospetto 5'!$AB$16",{"$f":"'prospetto 5'!$AB$16","v":0}]
["5000606","$AB$17","Prospetto 5",false,"prospetto 5'!$AB$17",{"$f":"'prospetto 5'!$AB$17","v":0}]
["5000706","$AB$18","Prospetto 5",true,"prospetto 5'!$AB$18",{"$f":"'prospetto 5'!$AB$18","v":0}]
["5000806","$AB$19","Prospetto 5",false,"prospetto 5'!$AB$19",{"$f":"'prospetto 5'!$AB$19","v":0}]
["5000906","$AB$20","Prospetto 5",false,"prospetto 5'!$AB$20",{"$f":"'prospetto 5'!$AB$20","v":0}]
["5001006","$AB$21","Prospetto 5",false,"prospetto 5'!$AB$21",{"$f":"'prospetto 5'!$AB$21","v":0}]
["5001106","$AB$22","Prospetto 5",false,"prospetto 5'!$AB$22",{"$f":"'prospetto 5'!$AB$22","v":0}]
["5001206","$AB$23","Prospetto 5",false,"prospetto 5'!$AB$23",{"$f":"'prospetto 5'!$AB$23","v":0}]
["5000107","$H$30","Prospetto 5",false,"prospetto 5'!$H$30",{"$f":"'prospetto 5'!$H$30","v":0}]
["5003207","$H$31","Prospetto 5",false,"prospetto 5'!$H$31",{"$f":"'prospetto 5'!$H$31","v":0}]
["5000207","$H$32","Prospetto 5",false,"prospetto 5'!$H$32",{"$f":"'prospetto 5'!$H$32","v":0}]
["5000307","$H$33","Prospetto 5",false,"prospetto 5'!$H$33",{"$f":"'prospetto 5'!$H$33","v":0}]
["5003107","$H$34","Prospetto 5",false,"prospetto 5'!$H$34",{"$f":"'prospetto 5'!$H$34","v":0}]
["5000407","$H$35","Prospetto 5",false,"prospetto 5'!$H$35",{"$f":"'prospetto 5'!$H$35","v":0}]
["5000507","$H$36","Prospetto 5",false,"prospetto 5'!$H$36",{"$f":"'prospetto 5'!$H$36","v":0}]
["5000607","$H$37","Prospetto 5",false,"prospetto 5'!$H$37",{"$f":"'prospetto 5'!$H$37","v":0}]
["5000707","$H$38","Prospetto 5",true,"prospetto 5'!$H$38",{"$f":"'prospetto 5'!$H$38","v":0}]
["5000807","$H$39","Prospetto 5",false,"prospetto 5'!$H$39",{"$f":"'prospetto 5'!$H$39","v":0}]
["5000907","$H$40","Prospetto 5",false,"prospetto 5'!$H$40",{"$f":"'prospetto 5'!$H$40","v":0}]
["5001007","$H$41","Prospetto 5",false,"prospetto 5'!$H$41",{"$f":"'prospetto 5'!$H$41","v":0}]
["5001107","$H$42","Prospetto 5",false,"prospetto 5'!$H$42",{"$f":"'prospetto 5'!$H$42","v":0}]
["5001207","$H$43","Prospetto 5",false,"prospetto 5'!$H$43",{"$f":"'prospetto 5'!$H$43","v":0}]
["5000108","$L$30","Prospetto 5",false,"prospetto 5'!$L$30",{"$f":"'prospetto 5'!$L$30","v":0}]
["5003208","$L$31","Prospetto 5",false,"prospetto 5'!$L$31",{"$f":"'prospetto 5'!$L$31","v":0}]
["5000208","$L$32","Prospetto 5",false,"prospetto 5'!$L$32",{"$f":"'prospetto 5'!$L$32","v":0}]
["5000308","$L$33","Prospetto 5",false,"prospetto 5'!$L$33",{"$f":"'prospetto 5'!$L$33","v":0}]
["5003108","$L$34","Prospetto 5",false,"prospetto 5'!$L$34",{"$f":"'prospetto 5'!$L$34","v":0}]
["5000408","$L$35","Prospetto 5",false,"prospetto 5'!$L$35",{"$f":"'prospetto 5'!$L$35","v":0}]
["5000508","$L$36","Prospetto 5",false,"prospetto 5'!$L$36",{"$f":"'prospetto 5'!$L$36","v":0}]
["5000608","$L$37","Prospetto 5",false,"prospetto 5'!$L$37",{"$f":"'prospetto 5'!$L$37","v":0}]
["5000708","$L$38","Prospetto 5",true,"prospetto 5'!$L$38",{"$f":"'prospetto 5'!$L$38","v":0}]
["5000808","$L$39","Prospetto 5",false,"prospetto 5'!$L$39",{"$f":"'prospetto 5'!$L$39","v":0}]
["5000908","$L$40","Prospetto 5",false,"prospetto 5'!$L$40",{"$f":"'prospetto 5'!$L$40","v":0}]
["5001008","$L$41","Prospetto 5",false,"prospetto 5'!$L$41",{"$f":"'prospetto 5'!$L$41","v":0}]
["5001108","$L$42","Prospetto 5",false,"prospetto 5'!$L$42",{"$f":"'prospetto 5'!$L$42","v":0}]
["5001208","$L$43","Prospetto 5",false,"prospetto 5'!$L$43",{"$f":"'prospetto 5'!$L$43","v":0}]
["5000109","$P$30","Prospetto 5",false,"prospetto 5'!$P$30",{"$f":"'prospetto 5'!$P$30","v":0}]
["5003209","$P$31","Prospetto 5",false,"prospetto 5'!$P$31",{"$f":"'prospetto 5'!$P$31","v":0}]
["5000209","$P$32","Prospetto 5",false,"prospetto 5'!$P$32",{"$f":"'prospetto 5'!$P$32","v":0}]
["5000309","$P$33","Prospetto 5",false,"prospetto 5'!$P$33",{"$f":"'prospetto 5'!$P$33","v":0}]
["5003109","$P$34","Prospetto 5",false,"prospetto 5'!$P$34",{"$f":"'prospetto 5'!$P$34","v":0}]
["5000409","$P$35","Prospetto 5",false,"prospetto 5'!$P$35",{"$f":"'prospetto 5'!$P$35","v":0}]
["5000509","$P$36","Prospetto 5",false,"prospetto 5'!$P$36",{"$f":"'prospetto 5'!$P$36","v":0}]
["5000609","$P$37","Prospetto 5",false,"prospetto 5'!$P$37",{"$f":"'prospetto 5'!$P$37","v":0}]
["5000709","$P$38","Prospetto 5",true,"prospetto 5'!$P$38",{"$f":"'prospetto 5'!$P$38","v":0}]
["5000809","$P$39","Prospetto 5",false,"prospetto 5'!$P$39",{"$f":"'prospetto 5'!$P$39","v":0}]
["5000909","$P$40","Prospetto 5",false,"prospetto 5'!$P$40",{"$f":"'prospetto 5'!$P$40","v":0}]
["5001009","$P$41","Prospetto 5",false,"prospetto 5'!$P$41",{"$f":"'prospetto 5'!$P$41","v":0}]
["5001109","$P$42","Prospetto 5",false,"prospetto 5'!$P$42",{"$f":"'prospetto 5'!$P$42","v":0}]
["5001209","$P$43","Prospetto 5",false,"prospetto 5'!$P$43",{"$f":"'prospetto 5'!$P$43","v":0}]
["5000110","$T$30","Prospetto 5",false,"prospetto 5'!$T$30",{"$f":"'prospetto 5'!$T$30","v":0}]
["5003210","$T$31","Prospetto 5",false,"prospetto 5'!$T$31",{"$f":"'prospetto 5'!$T$31","v":0}]
["5000210","$T$32","Prospetto 5",false,"prospetto 5'!$T$32",{"$f":"'prospetto 5'!$T$32","v":0}]
["5000310","$T$33","Prospetto 5",false,"prospetto 5'!$T$33",{"$f":"'prospetto 5'!$T$33","v":0}]
["5003110","$T$34","Prospetto 5",false,"prospetto 5'!$T$34",{"$f":"'prospetto 5'!$T$34","v":0}]
["5000410","$T$35","Prospetto 5",false,"prospetto 5'!$T$35",{"$f":"'prospetto 5'!$T$35","v":0}]
["5000510","$T$36","Prospetto 5",false,"prospetto 5'!$T$36",{"$f":"'prospetto 5'!$T$36","v":0}]
["5000610","$T$37","Prospetto 5",false,"prospetto 5'!$T$37",{"$f":"'prospetto 5'!$T$37","v":0}]
["5000710","$T$38","Prospetto 5",true,"prospetto 5'!$T$38",{"$f":"'prospetto 5'!$T$38","v":0}]
["5000810","$T$39","Prospetto 5",false,"prospetto 5'!$T$39",{"$f":"'prospetto 5'!$T$39","v":0}]
["5000910","$T$40","Prospetto 5",false,"prospetto 5'!$T$40",{"$f":"'prospetto 5'!$T$40","v":0}]
["5001010","$T$41","Prospetto 5",false,"prospetto 5'!$T$41",{"$f":"'prospetto 5'!$T$41","v":0}]
["5001110","$T$42","Prospetto 5",false,"prospetto 5'!$T$42",{"$f":"'prospetto 5'!$T$42","v":0}]
["5001210","$T$43","Prospetto 5",false,"prospetto 5'!$T$43",{"$f":"'prospetto 5'!$T$43","v":0}]
["5000111","$X$30","Prospetto 5",false,"prospetto 5'!$X$30",{"$f":"'prospetto 5'!$X$30","v":0}]
["5003211","$X$31","Prospetto 5",false,"prospetto 5'!$X$31",{"$f":"'prospetto 5'!$X$31","v":0}]
["5000211","$X$32","Prospetto 5",false,"prospetto 5'!$X$32",{"$f":"'prospetto 5'!$X$32","v":0}]
["5000311","$X$33","Prospetto 5",false,"prospetto 5'!$X$33",{"$f":"'prospetto 5'!$X$33","v":0}]
["5003111","$X$34","Prospetto 5",false,"prospetto 5'!$X$34",{"$f":"'prospetto 5'!$X$34","v":0}]
["5000411","$X$35","Prospetto 5",false,"prospetto 5'!$X$35",{"$f":"'prospetto 5'!$X$35","v":0}]
["5000511","$X$36","Prospetto 5",false,"prospetto 5'!$X$36",{"$f":"'prospetto 5'!$X$36","v":0}]
["5000611","$X$37","Prospetto 5",false,"prospetto 5'!$X$37",{"$f":"'prospetto 5'!$X$37","v":0}]
["5000711","$X$38","Prospetto 5",true,"prospetto 5'!$X$38",{"$f":"'prospetto 5'!$X$38","v":0}]
["5000811","$X$39","Prospetto 5",false,"prospetto 5'!$X$39",{"$f":"'prospetto 5'!$X$39","v":0}]
["5000911","$X$40","Prospetto 5",false,"prospetto 5'!$X$40",{"$f":"'prospetto 5'!$X$40","v":0}]
["5001011","$X$41","Prospetto 5",false,"prospetto 5'!$X$41",{"$f":"'prospetto 5'!$X$41","v":0}]
["5001111","$X$42","Prospetto 5",false,"prospetto 5'!$X$42",{"$f":"'prospetto 5'!$X$42","v":0}]
["5001211","$X$43","Prospetto 5",false,"prospetto 5'!$X$43",{"$f":"'prospetto 5'!$X$43","v":0}]
["5000112","$AB$30","Prospetto 5",false,"prospetto 5'!$AB$30",{"$f":"'prospetto 5'!$AB$30","v":0}]
["5003212","$AB$31","Prospetto 5",false,"prospetto 5'!$AB$31",{"$f":"'prospetto 5'!$AB$31","v":0}]
["5000212","$AB$32","Prospetto 5",false,"prospetto 5'!$AB$32",{"$f":"'prospetto 5'!$AB$32","v":0}]
["5000312","$AB$33","Prospetto 5",false,"prospetto 5'!$AB$33",{"$f":"'prospetto 5'!$AB$33","v":0}]
["5003112","$AB$34","Prospetto 5",false,"prospetto 5'!$AB$34",{"$f":"'prospetto 5'!$AB$34","v":0}]
["5000412","$AB$35","Prospetto 5",false,"prospetto 5'!$AB$35",{"$f":"'prospetto 5'!$AB$35","v":0}]
["5000512","$AB$36","Prospetto 5",false,"prospetto 5'!$AB$36",{"$f":"'prospetto 5'!$AB$36","v":0}]
["5000612","$AB$37","Prospetto 5",false,"prospetto 5'!$AB$37",{"$f":"'prospetto 5'!$AB$37","v":0}]
["5000712","$AB$38","Prospetto 5",true,"prospetto 5'!$AB$38",{"$f":"'prospetto 5'!$AB$38","v":0}]
["5000812","$AB$39","Prospetto 5",false,"prospetto 5'!$AB$39",{"$f":"'prospetto 5'!$AB$39","v":0}]
["5000912","$AB$40","Prospetto 5",false,"prospetto 5'!$AB$40",{"$f":"'prospetto 5'!$AB$40","v":0}]
["5001012","$AB$41","Prospetto 5",false,"prospetto 5'!$AB$41",{"$f":"'prospetto 5'!$AB$41","v":0}]
["5001112","$AB$42","Prospetto 5",false,"prospetto 5'!$AB$42",{"$f":"'prospetto 5'!$AB$42","v":0}]
["5001212","$AB$43","Prospetto 5",false,"prospetto 5'!$AB$43",{"$f":"'prospetto 5'!$AB$43","v":0}]
["5000113","$H$50","Prospetto 5",false,"prospetto 5'!$H$50",{"$f":"'prospetto 5'!$H$50","v":0}]
["5003213","$H$51","Prospetto 5",false,"prospetto 5'!$H$51",{"$f":"'prospetto 5'!$H$51","v":0}]
["5000213","$H$52","Prospetto 5",false,"prospetto 5'!$H$52",{"$f":"'prospetto 5'!$H$52","v":0}]
["5000313","$H$53","Prospetto 5",false,"prospetto 5'!$H$53",{"$f":"'prospetto 5'!$H$53","v":0}]
["5003113","$H$54","Prospetto 5",false,"prospetto 5'!$H$54",{"$f":"'prospetto 5'!$H$54","v":0}]
["5000413","$H$55","Prospetto 5",false,"prospetto 5'!$H$55",{"$f":"'prospetto 5'!$H$55","v":0}]
["5000513","$H$56","Prospetto 5",false,"prospetto 5'!$H$56",{"$f":"'prospetto 5'!$H$56","v":0}]
["5000613","$H$57","Prospetto 5",false,"prospetto 5'!$H$57",{"$f":"'prospetto 5'!$H$57","v":0}]
["5000713","$H$58","Prospetto 5",true,"prospetto 5'!$H$58",{"$f":"'prospetto 5'!$H$58","v":0}]
["5000813","$H$59","Prospetto 5",false,"prospetto 5'!$H$59",{"$f":"'prospetto 5'!$H$59","v":0}]
["5000913","$H$60","Prospetto 5",false,"prospetto 5'!$H$60",{"$f":"'prospetto 5'!$H$60","v":0}]
["5001013","$H$61","Prospetto 5",false,"prospetto 5'!$H$61",{"$f":"'prospetto 5'!$H$61","v":0}]
["5001113","$H$62","Prospetto 5",false,"prospetto 5'!$H$62",{"$f":"'prospetto 5'!$H$62","v":0}]
["5001213","$H$63","Prospetto 5",false,"prospetto 5'!$H$63",{"$f":"'prospetto 5'!$H$63","v":0}]
["5000114","$L$50","Prospetto 5",false,"prospetto 5'!$L$50",{"$f":"'prospetto 5'!$L$50","v":0}]
["5003214","$L$51","Prospetto 5",false,"prospetto 5'!$L$51",{"$f":"'prospetto 5'!$L$51","v":0}]
["5000214","$L$52","Prospetto 5",false,"prospetto 5'!$L$52",{"$f":"'prospetto 5'!$L$52","v":0}]
["5000314","$L$53","Prospetto 5",false,"prospetto 5'!$L$53",{"$f":"'prospetto 5'!$L$53","v":0}]
["5003114","$L$54","Prospetto 5",false,"prospetto 5'!$L$54",{"$f":"'prospetto 5'!$L$54","v":0}]
["5000414","$L$55","Prospetto 5",false,"prospetto 5'!$L$55",{"$f":"'prospetto 5'!$L$55","v":0}]
["5000514","$L$56","Prospetto 5",false,"prospetto 5'!$L$56",{"$f":"'prospetto 5'!$L$56","v":0}]
["5000614","$L$57","Prospetto 5",false,"prospetto 5'!$L$57",{"$f":"'prospetto 5'!$L$57","v":0}]
["5000714","$L$58","Prospetto 5",true,"prospetto 5'!$L$58",{"$f":"'prospetto 5'!$L$58","v":0}]
["5000814","$L$59","Prospetto 5",false,"prospetto 5'!$L$59",{"$f":"'prospetto 5'!$L$59","v":0}]
["5000914","$L$60","Prospetto 5",false,"prospetto 5'!$L$60",{"$f":"'prospetto 5'!$L$60","v":0}]
["5001014","$L$61","Prospetto 5",false,"prospetto 5'!$L$61",{"$f":"'prospetto 5'!$L$61","v":0}]
["5001114","$L$62","Prospetto 5",false,"prospetto 5'!$L$62",{"$f":"'prospetto 5'!$L$62","v":0}]
["5001214","$L$63","Prospetto 5",false,"prospetto 5'!$L$63",{"$f":"'prospetto 5'!$L$63","v":0}]
["5000115","$P$50","Prospetto 5",false,"prospetto 5'!$P$50",{"$f":"'prospetto 5'!$P$50","v":0}]
["5003215","$P$51","Prospetto 5",false,"prospetto 5'!$P$51",{"$f":"'prospetto 5'!$P$51","v":0}]
["5000215","$P$52","Prospetto 5",false,"prospetto 5'!$P$52",{"$f":"'prospetto 5'!$P$52","v":0}]
["5000315","$P$53","Prospetto 5",false,"prospetto 5'!$P$53",{"$f":"'prospetto 5'!$P$53","v":0}]
["5003115","$P$54","Prospetto 5",false,"prospetto 5'!$P$54",{"$f":"'prospetto 5'!$P$54","v":0}]
["5000415","$P$55","Prospetto 5",false,"prospetto 5'!$P$55",{"$f":"'prospetto 5'!$P$55","v":0}]
["5000515","$P$56","Prospetto 5",false,"prospetto 5'!$P$56",{"$f":"'prospetto 5'!$P$56","v":0}]
["5000615","$P$57","Prospetto 5",false,"prospetto 5'!$P$57",{"$f":"'prospetto 5'!$P$57","v":0}]
["5000715","$P$58","Prospetto 5",true,"prospetto 5'!$P$58",{"$f":"'prospetto 5'!$P$58","v":0}]
["5000815","$P$59","Prospetto 5",false,"prospetto 5'!$P$59",{"$f":"'prospetto 5'!$P$59","v":0}]
["5000915","$P$60","Prospetto 5",false,"prospetto 5'!$P$60",{"$f":"'prospetto 5'!$P$60","v":0}]
["5001015","$P$61","Prospetto 5",false,"prospetto 5'!$P$61",{"$f":"'prospetto 5'!$P$61","v":0}]
["5001115","$P$62","Prospetto 5",false,"prospetto 5'!$P$62",{"$f":"'prospetto 5'!$P$62","v":0}]
["5001215","$P$63","Prospetto 5",false,"prospetto 5'!$P$63",{"$f":"'prospetto 5'!$P$63","v":0}]
["5000116","$T$50","Prospetto 5",false,"prospetto 5'!$T$50",{"$f":"'prospetto 5'!$T$50","v":0}]
["5003216","$T$51","Prospetto 5",false,"prospetto 5'!$T$51",{"$f":"'prospetto 5'!$T$51","v":0}]
["5000216","$T$52","Prospetto 5",false,"prospetto 5'!$T$52",{"$f":"'prospetto 5'!$T$52","v":0}]
["5000316","$T$53","Prospetto 5",false,"prospetto 5'!$T$53",{"$f":"'prospetto 5'!$T$53","v":0}]
["5003116","$T$54","Prospetto 5",false,"prospetto 5'!$T$54",{"$f":"'prospetto 5'!$T$54","v":0}]
["5000416","$T$55","Prospetto 5",false,"prospetto 5'!$T$55",{"$f":"'prospetto 5'!$T$55","v":0}]
["5000516","$T$56","Prospetto 5",false,"prospetto 5'!$T$56",{"$f":"'prospetto 5'!$T$56","v":0}]
["5000616","$T$57","Prospetto 5",false,"prospetto 5'!$T$57",{"$f":"'prospetto 5'!$T$57","v":0}]
["5000716","$T$58","Prospetto 5",true,"prospetto 5'!$T$58",{"$f":"'prospetto 5'!$T$58","v":0}]
["5000816","$T$59","Prospetto 5",false,"prospetto 5'!$T$59",{"$f":"'prospetto 5'!$T$59","v":0}]
["5000916","$T$60","Prospetto 5",false,"prospetto 5'!$T$60",{"$f":"'prospetto 5'!$T$60","v":0}]
["5001016","$T$61","Prospetto 5",false,"prospetto 5'!$T$61",{"$f":"'prospetto 5'!$T$61","v":0}]
["5001116","$T$62","Prospetto 5",false,"prospetto 5'!$T$62",{"$f":"'prospetto 5'!$T$62","v":0}]
["5001216","$T$63","Prospetto 5",false,"prospetto 5'!$T$63",{"$f":"'prospetto 5'!$T$63","v":0}]
["5000117","$X$50","Prospetto 5",false,"prospetto 5'!$X$50",{"$f":"'prospetto 5'!$X$50","v":0}]
["5003217","$X$51","Prospetto 5",false,"prospetto 5'!$X$51",{"$f":"'prospetto 5'!$X$51","v":0}]
["5000217","$X$52","Prospetto 5",false,"prospetto 5'!$X$52",{"$f":"'prospetto 5'!$X$52","v":0}]
["5000317","$X$53","Prospetto 5",false,"prospetto 5'!$X$53",{"$f":"'prospetto 5'!$X$53","v":0}]
["5003117","$X$54","Prospetto 5",false,"prospetto 5'!$X$54",{"$f":"'prospetto 5'!$X$54","v":0}]
["5000417","$X$55","Prospetto 5",false,"prospetto 5'!$X$55",{"$f":"'prospetto 5'!$X$55","v":0}]
["5000517","$X$56","Prospetto 5",false,"prospetto 5'!$X$56",{"$f":"'prospetto 5'!$X$56","v":0}]
["5000617","$X$57","Prospetto 5",false,"prospetto 5'!$X$57",{"$f":"'prospetto 5'!$X$57","v":0}]
["5000717","$X$58","Prospetto 5",true,"prospetto 5'!$X$58",{"$f":"'prospetto 5'!$X$58","v":0}]
["5000817","$X$59","Prospetto 5",false,"prospetto 5'!$X$59",{"$f":"'prospetto 5'!$X$59","v":0}]
["5000917","$X$60","Prospetto 5",false,"prospetto 5'!$X$60",{"$f":"'prospetto 5'!$X$60","v":0}]
["5001017","$X$61","Prospetto 5",false,"prospetto 5'!$X$61",{"$f":"'prospetto 5'!$X$61","v":0}]
["5001117","$X$62","Prospetto 5",false,"prospetto 5'!$X$62",{"$f":"'prospetto 5'!$X$62","v":0}]
["5001217","$X$63","Prospetto 5",false,"prospetto 5'!$X$63",{"$f":"'prospetto 5'!$X$63","v":0}]
["5000118","$AB$50","Prospetto 5",false,"prospetto 5'!$AB$50",{"$f":"'prospetto 5'!$AB$50","v":0}]
["5003218","$AB$51","Prospetto 5",false,"prospetto 5'!$AB$51",{"$f":"'prospetto 5'!$AB$51","v":0}]
["5000218","$AB$52","Prospetto 5",false,"prospetto 5'!$AB$52",{"$f":"'prospetto 5'!$AB$52","v":0}]
["5000318","$AB$53","Prospetto 5",false,"prospetto 5'!$AB$53",{"$f":"'prospetto 5'!$AB$53","v":0}]
["5003118","$AB$54","Prospetto 5",false,"prospetto 5'!$AB$54",{"$f":"'prospetto 5'!$AB$54","v":0}]
["5000418","$AB$55","Prospetto 5",false,"prospetto 5'!$AB$55",{"$f":"'prospetto 5'!$AB$55","v":0}]
["5000518","$AB$56","Prospetto 5",false,"prospetto 5'!$AB$56",{"$f":"'prospetto 5'!$AB$56","v":0}]
["5000618","$AB$57","Prospetto 5",false,"prospetto 5'!$AB$57",{"$f":"'prospetto 5'!$AB$57","v":0}]
["5000718","$AB$58","Prospetto 5",true,"prospetto 5'!$AB$58",{"$f":"'prospetto 5'!$AB$58","v":0}]
["5000818","$AB$59","Prospetto 5",false,"prospetto 5'!$AB$59",{"$f":"'prospetto 5'!$AB$59","v":0}]
["5000918","$AB$60","Prospetto 5",false,"prospetto 5'!$AB$60",{"$f":"'prospetto 5'!$AB$60","v":0}]
["5001018","$AB$61","Prospetto 5",false,"prospetto 5'!$AB$61",{"$f":"'prospetto 5'!$AB$61","v":0}]
["5001118","$AB$62","Prospetto 5",false,"prospetto 5'!$AB$62",{"$f":"'prospetto 5'!$AB$62","v":0}]
["5001218","$AB$63","Prospetto 5",false,"prospetto 5'!$AB$63",{"$f":"'prospetto 5'!$AB$63","v":0}]
["5100100","$C$14","Prospetto 5.1",false,"prospetto 5.1'!$C$14",{"$f":"'prospetto 5.1'!$C$14","v":0}]
["5100200","$C$15","Prospetto 5.1",false,"prospetto 5.1'!$C$15",{"$f":"'prospetto 5.1'!$C$15","v":0}]
["5100300","$C$16","Prospetto 5.1",false,"prospetto 5.1'!$C$16",{"$f":"'prospetto 5.1'!$C$16","v":0}]
["5100400","$C$17","Prospetto 5.1",false,"prospetto 5.1'!$C$17",{"$f":"'prospetto 5.1'!$C$17","v":0}]
["5106500","$C$20","Prospetto 5.1",false,"prospetto 5.1'!$C$20",{"$f":"'prospetto 5.1'!$C$20","v":0}]
["5100500","$E$14","Prospetto 5.1",false,"prospetto 5.1'!$E$14",{"$f":"'prospetto 5.1'!$E$14","v":0}]
["5100600","$E$15","Prospetto 5.1",false,"prospetto 5.1'!$E$15",{"$f":"'prospetto 5.1'!$E$15","v":0}]
["5100700","$E$16","Prospetto 5.1",false,"prospetto 5.1'!$E$16",{"$f":"'prospetto 5.1'!$E$16","v":0}]
["5100800","$E$17","Prospetto 5.1",false,"prospetto 5.1'!$E$17",{"$f":"'prospetto 5.1'!$E$17","v":0}]
["5100900","$E$18","Prospetto 5.1",true,"prospetto 5.1'!$E$18",{"$f":"'prospetto 5.1'!$E$18","v":0}]
["5106600","$E$20","Prospetto 5.1",false,"prospetto 5.1'!$E$20",{"$f":"'prospetto 5.1'!$E$20","v":0}]
["5101000","$G$14","Prospetto 5.1",false,"prospetto 5.1'!$G$14",{"$f":"'prospetto 5.1'!$G$14","v":0}]
["5101100","$G$15","Prospetto 5.1",false,"prospetto 5.1'!$G$15",{"$f":"'prospetto 5.1'!$G$15","v":0}]
["5101200","$G$16","Prospetto 5.1",false,"prospetto 5.1'!$G$16",{"$f":"'prospetto 5.1'!$G$16","v":0}]
["5101300","$G$17","Prospetto 5.1",false,"prospetto 5.1'!$G$17",{"$f":"'prospetto 5.1'!$G$17","v":0}]
["5106700","$G$20","Prospetto 5.1",false,"prospetto 5.1'!$G$20",{"$f":"'prospetto 5.1'!$G$20","v":0}]
["5101400","$I$14","Prospetto 5.1",false,"prospetto 5.1'!$I$14",{"$f":"'prospetto 5.1'!$I$14","v":0}]
["5101500","$I$15","Prospetto 5.1",false,"prospetto 5.1'!$I$15",{"$f":"'prospetto 5.1'!$I$15","v":0}]
["5101600","$I$16","Prospetto 5.1",false,"prospetto 5.1'!$I$16",{"$f":"'prospetto 5.1'!$I$16","v":0}]
["5101700","$I$17","Prospetto 5.1",false,"prospetto 5.1'!$I$17",{"$f":"'prospetto 5.1'!$I$17","v":0}]
["5101800","$I$18","Prospetto 5.1",true,"prospetto 5.1'!$I$18",{"$f":"'prospetto 5.1'!$I$18","v":0}]
["5106800","$I$20","Prospetto 5.1",false,"prospetto 5.1'!$I$20",{"$f":"'prospetto 5.1'!$I$20","v":0}]
["5101900","$K$14","Prospetto 5.1",false,"prospetto 5.1'!$K$14",{"$f":"'prospetto 5.1'!$K$14","v":0}]
["5102000","$K$15","Prospetto 5.1",false,"prospetto 5.1'!$K$15",{"$f":"'prospetto 5.1'!$K$15","v":0}]
["5102100","$K$16","Prospetto 5.1",false,"prospetto 5.1'!$K$16",{"$f":"'prospetto 5.1'!$K$16","v":0}]
["5102200","$K$17","Prospetto 5.1",false,"prospetto 5.1'!$K$17",{"$f":"'prospetto 5.1'!$K$17","v":0}]
["5102300","$K$18","Prospetto 5.1",true,"prospetto 5.1'!$K$18",{"$f":"'prospetto 5.1'!$K$18","v":0}]
["5106900","$K$20","Prospetto 5.1",false,"prospetto 5.1'!$K$20",{"$f":"'prospetto 5.1'!$K$20","v":0}]
["5102400","$M$14","Prospetto 5.1",false,"prospetto 5.1'!$M$14",{"$f":"'prospetto 5.1'!$M$14","v":0}]
["5102500","$M$15","Prospetto 5.1",false,"prospetto 5.1'!$M$15",{"$f":"'prospetto 5.1'!$M$15","v":0}]
["5102600","$M$16","Prospetto 5.1",false,"prospetto 5.1'!$M$16",{"$f":"'prospetto 5.1'!$M$16","v":0}]
["5102700","$M$17","Prospetto 5.1",false,"prospetto 5.1'!$M$17",{"$f":"'prospetto 5.1'!$M$17","v":0}]
["5107000","$M$20","Prospetto 5.1",false,"prospetto 5.1'!$M$20",{"$f":"'prospetto 5.1'!$M$20","v":0}]
["5102800","$O$14","Prospetto 5.1",false,"prospetto 5.1'!$O$14",{"$f":"'prospetto 5.1'!$O$14","v":0}]
["5102900","$O$15","Prospetto 5.1",false,"prospetto 5.1'!$O$15",{"$f":"'prospetto 5.1'!$O$15","v":0}]
["5103000","$O$16","Prospetto 5.1",false,"prospetto 5.1'!$O$16",{"$f":"'prospetto 5.1'!$O$16","v":0}]
["5103100","$O$17","Prospetto 5.1",false,"prospetto 5.1'!$O$17",{"$f":"'prospetto 5.1'!$O$17","v":0}]
["5103200","$O$18","Prospetto 5.1",true,"prospetto 5.1'!$O$18",{"$f":"'prospetto 5.1'!$O$18","v":0}]
["5107100","$O$20","Prospetto 5.1",false,"prospetto 5.1'!$O$20",{"$f":"'prospetto 5.1'!$O$20","v":0}]
["5103300","$Q$14","Prospetto 5.1",false,"prospetto 5.1'!$Q$14",{"$f":"'prospetto 5.1'!$Q$14","v":0}]
["5103400","$Q$15","Prospetto 5.1",false,"prospetto 5.1'!$Q$15",{"$f":"'prospetto 5.1'!$Q$15","v":0}]
["5103500","$Q$16","Prospetto 5.1",false,"prospetto 5.1'!$Q$16",{"$f":"'prospetto 5.1'!$Q$16","v":0}]
["5103600","$Q$17","Prospetto 5.1",false,"prospetto 5.1'!$Q$17",{"$f":"'prospetto 5.1'!$Q$17","v":0}]
["5107200","$Q$20","Prospetto 5.1",false,"prospetto 5.1'!$Q$20",{"$f":"'prospetto 5.1'!$Q$20","v":0}]
["5103700","$S$14","Prospetto 5.1",false,"prospetto 5.1'!$S$14",{"$f":"'prospetto 5.1'!$S$14","v":0}]
["5103800","$S$15","Prospetto 5.1",false,"prospetto 5.1'!$S$15",{"$f":"'prospetto 5.1'!$S$15","v":0}]
["5103900","$S$16","Prospetto 5.1",false,"prospetto 5.1'!$S$16",{"$f":"'prospetto 5.1'!$S$16","v":0}]
["5104000","$S$17","Prospetto 5.1",false,"prospetto 5.1'!$S$17",{"$f":"'prospetto 5.1'!$S$17","v":0}]
["5104100","$S$18","Prospetto 5.1",true,"prospetto 5.1'!$S$18",{"$f":"'prospetto 5.1'!$S$18","v":0}]
["5107300","$S$20","Prospetto 5.1",false,"prospetto 5.1'!$S$20",{"$f":"'prospetto 5.1'!$S$20","v":0}]
["5104200","$U$14","Prospetto 5.1",false,"prospetto 5.1'!$U$14",{"$f":"'prospetto 5.1'!$U$14","v":0}]
["5104300","$U$15","Prospetto 5.1",false,"prospetto 5.1'!$U$15",{"$f":"'prospetto 5.1'!$U$15","v":0}]
["5104400","$U$16","Prospetto 5.1",false,"prospetto 5.1'!$U$16",{"$f":"'prospetto 5.1'!$U$16","v":0}]
["5104500","$U$17","Prospetto 5.1",false,"prospetto 5.1'!$U$17",{"$f":"'prospetto 5.1'!$U$17","v":0}]
["5107400","$U$20","Prospetto 5.1",false,"prospetto 5.1'!$U$20",{"$f":"'prospetto 5.1'!$U$20","v":0}]
["5104600","$W$14","Prospetto 5.1",false,"prospetto 5.1'!$W$14",{"$f":"'prospetto 5.1'!$W$14","v":0}]
["5104700","$W$15","Prospetto 5.1",false,"prospetto 5.1'!$W$15",{"$f":"'prospetto 5.1'!$W$15","v":0}]
["5104800","$W$16","Prospetto 5.1",false,"prospetto 5.1'!$W$16",{"$f":"'prospetto 5.1'!$W$16","v":0}]
["5104900","$W$17","Prospetto 5.1",false,"prospetto 5.1'!$W$17",{"$f":"'prospetto 5.1'!$W$17","v":0}]
["5105000","$W$18","Prospetto 5.1",true,"prospetto 5.1'!$W$18",{"$f":"'prospetto 5.1'!$W$18","v":0}]
["5107500","$W$20","Prospetto 5.1",false,"prospetto 5.1'!$W$20",{"$f":"'prospetto 5.1'!$W$20","v":0}]
["5105100","$Y$14","Prospetto 5.1",false,"prospetto 5.1'!$Y$14",{"$f":"'prospetto 5.1'!$Y$14","v":0}]
["5105200","$Y$15","Prospetto 5.1",false,"prospetto 5.1'!$Y$15",{"$f":"'prospetto 5.1'!$Y$15","v":0}]
["5105300","$Y$16","Prospetto 5.1",false,"prospetto 5.1'!$Y$16",{"$f":"'prospetto 5.1'!$Y$16","v":0}]
["5105400","$Y$17","Prospetto 5.1",false,"prospetto 5.1'!$Y$17",{"$f":"'prospetto 5.1'!$Y$17","v":0}]
["5107600","$Y$20","Prospetto 5.1",false,"prospetto 5.1'!$Y$20",{"$f":"'prospetto 5.1'!$Y$20","v":0}]
["5105500","$AA$14","Prospetto 5.1",false,"prospetto 5.1'!$AA$14",{"$f":"'prospetto 5.1'!$AA$14","v":0}]
["5105600","$AA$15","Prospetto 5.1",false,"prospetto 5.1'!$AA$15",{"$f":"'prospetto 5.1'!$AA$15","v":0}]
["5105700","$AA$16","Prospetto 5.1",false,"prospetto 5.1'!$AA$16",{"$f":"'prospetto 5.1'!$AA$16","v":0}]
["5105800","$AA$17","Prospetto 5.1",false,"prospetto 5.1'!$AA$17",{"$f":"'prospetto 5.1'!$AA$17","v":0}]
["5105900","$AA$18","Prospetto 5.1",true,"prospetto 5.1'!$AA$18",{"$f":"'prospetto 5.1'!$AA$18","v":0}]
["5107700","$AA$20","Prospetto 5.1",false,"prospetto 5.1'!$AA$20",{"$f":"'prospetto 5.1'!$AA$20","v":0}]
["5106000","$AC$14","Prospetto 5.1",false,"prospetto 5.1'!$AC$14",{"$f":"'prospetto 5.1'!$AC$14","v":0}]
["5106100","$AC$15","Prospetto 5.1",false,"prospetto 5.1'!$AC$15",{"$f":"'prospetto 5.1'!$AC$15","v":0}]
["5106200","$AC$16","Prospetto 5.1",false,"prospetto 5.1'!$AC$16",{"$f":"'prospetto 5.1'!$AC$16","v":0}]
["5106300","$AC$17","Prospetto 5.1",false,"prospetto 5.1'!$AC$17",{"$f":"'prospetto 5.1'!$AC$17","v":0}]
["5106400","$AC$18","Prospetto 5.1",true,"prospetto 5.1'!$AC$18",{"$f":"'prospetto 5.1'!$AC$18","v":0}]
["5107800","$AC$20","Prospetto 5.1",false,"prospetto 5.1'!$AC$20",{"$f":"'prospetto 5.1'!$AC$20","v":0}]
["5108000","$M$41","Prospetto 5.1",false,"prospetto 5.1'!$M$41",{"$f":"'prospetto 5.1'!$M$41","v":0}]
["5108500","$M$54","Prospetto 5.1",false,"prospetto 5.1'!$M$54",{"$f":"'prospetto 5.1'!$M$54","v":0}]
["5108600","$M$57","Prospetto 5.1",false,"prospetto 5.1'!$M$57",{"$f":"'prospetto 5.1'!$M$57","v":0}]
["5107900","$C$41","Prospetto 5.1",false,"prospetto 5.1'!$C$41",{"$f":"'prospetto 5.1'!$C$41","v":0}]
["5108100","$W$44","Prospetto 5.1",false,"prospetto 5.1'!$W$44",{"$f":"'prospetto 5.1'!$W$44","v":0}]
["5108200","$W$46","Prospetto 5.1",false,"prospetto 5.1'!$W$46",{"$f":"'prospetto 5.1'!$W$46","v":0}]
["5108300","$W$49","Prospetto 5.1",false,"prospetto 5.1'!$W$49",{"$f":"'prospetto 5.1'!$W$49","v":0}]
["5108400","$W$51","Prospetto 5.1",false,"prospetto 5.1'!$W$51",{"$f":"'prospetto 5.1'!$W$51","v":0}]
["5200100","$C$15","Prospetto 5.2",false,"prospetto 5.2'!$C$15",{"$f":"'prospetto 5.2'!$C$15","v":0}]
["5200200","$C$16","Prospetto 5.2",false,"prospetto 5.2'!$C$16",{"$f":"'prospetto 5.2'!$C$16","v":0}]
["5200300","$C$17","Prospetto 5.2",false,"prospetto 5.2'!$C$17",{"$f":"'prospetto 5.2'!$C$17","v":0}]
["5200400","$C$18","Prospetto 5.2",false,"prospetto 5.2'!$C$18",{"$f":"'prospetto 5.2'!$C$18","v":0}]
["5200500","$C$19","Prospetto 5.2",true,"prospetto 5.2'!$C$19",{"$f":"'prospetto 5.2'!$C$19","v":0}]
["5206600","$C$21","Prospetto 5.2",false,"prospetto 5.2'!$C$21",{"$f":"'prospetto 5.2'!$C$21","v":0}]
["5200600","$E$15","Prospetto 5.2",false,"prospetto 5.2'!$E$15",{"$f":"'prospetto 5.2'!$E$15","v":0}]
["5200700","$E$16","Prospetto 5.2",false,"prospetto 5.2'!$E$16",{"$f":"'prospetto 5.2'!$E$16","v":0}]
["5200800","$E$17","Prospetto 5.2",false,"prospetto 5.2'!$E$17",{"$f":"'prospetto 5.2'!$E$17","v":0}]
["5200900","$E$18","Prospetto 5.2",false,"prospetto 5.2'!$E$18",{"$f":"'prospetto 5.2'!$E$18","v":0}]
["5201000","$E$19","Prospetto 5.2",true,"prospetto 5.2'!$E$19",{"$f":"'prospetto 5.2'!$E$19","v":0}]
["5206700","$E$21","Prospetto 5.2",false,"prospetto 5.2'!$E$21",{"$f":"'prospetto 5.2'!$E$21","v":0}]
["5201100","$G$15","Prospetto 5.2",false,"prospetto 5.2'!$G$15",{"$f":"'prospetto 5.2'!$G$15","v":0}]
["5201200","$G$16","Prospetto 5.2",false,"prospetto 5.2'!$G$16",{"$f":"'prospetto 5.2'!$G$16","v":0}]
["5201300","$G$17","Prospetto 5.2",false,"prospetto 5.2'!$G$17",{"$f":"'prospetto 5.2'!$G$17","v":0}]
["5201400","$G$18","Prospetto 5.2",false,"prospetto 5.2'!$G$18",{"$f":"'prospetto 5.2'!$G$18","v":0}]
["5201500","$G$19","Prospetto 5.2",true,"prospetto 5.2'!$G$19",{"$f":"'prospetto 5.2'!$G$19","v":0}]
["5206800","$G$21","Prospetto 5.2",false,"prospetto 5.2'!$G$21",{"$f":"'prospetto 5.2'!$G$21","v":0}]
["5201600","$I$15","Prospetto 5.2",false,"prospetto 5.2'!$I$15",{"$f":"'prospetto 5.2'!$I$15","v":0}]
["5201700","$I$16","Prospetto 5.2",false,"prospetto 5.2'!$I$16",{"$f":"'prospetto 5.2'!$I$16","v":0}]
["5201800","$I$17","Prospetto 5.2",false,"prospetto 5.2'!$I$17",{"$f":"'prospetto 5.2'!$I$17","v":0}]
["5201900","$I$18","Prospetto 5.2",false,"prospetto 5.2'!$I$18",{"$f":"'prospetto 5.2'!$I$18","v":0}]
["5202000","$I$19","Prospetto 5.2",true,"prospetto 5.2'!$I$19",{"$f":"'prospetto 5.2'!$I$19","v":0}]
["5206900","$I$21","Prospetto 5.2",false,"prospetto 5.2'!$I$21",{"$f":"'prospetto 5.2'!$I$21","v":0}]
["5202100","$K$15","Prospetto 5.2",false,"prospetto 5.2'!$K$15",{"$f":"'prospetto 5.2'!$K$15","v":0}]
["5202200","$K$16","Prospetto 5.2",false,"prospetto 5.2'!$K$16",{"$f":"'prospetto 5.2'!$K$16","v":0}]
["5202300","$K$17","Prospetto 5.2",false,"prospetto 5.2'!$K$17",{"$f":"'prospetto 5.2'!$K$17","v":0}]
["5202400","$K$18","Prospetto 5.2",false,"prospetto 5.2'!$K$18",{"$f":"'prospetto 5.2'!$K$18","v":0}]
["5202500","$K$19","Prospetto 5.2",true,"prospetto 5.2'!$K$19",{"$f":"'prospetto 5.2'!$K$19","v":0}]
["5207000","$K$21","Prospetto 5.2",false,"prospetto 5.2'!$K$21",{"$f":"'prospetto 5.2'!$K$21","v":0}]
["5202600","$M$15","Prospetto 5.2",false,"prospetto 5.2'!$M$15",{"$f":"'prospetto 5.2'!$M$15","v":0}]
["5202700","$M$16","Prospetto 5.2",false,"prospetto 5.2'!$M$16",{"$f":"'prospetto 5.2'!$M$16","v":0}]
["5202800","$M$17","Prospetto 5.2",false,"prospetto 5.2'!$M$17",{"$f":"'prospetto 5.2'!$M$17","v":0}]
["5202900","$M$18","Prospetto 5.2",false,"prospetto 5.2'!$M$18",{"$f":"'prospetto 5.2'!$M$18","v":0}]
["5203000","$M$19","Prospetto 5.2",true,"prospetto 5.2'!$M$19",{"$f":"'prospetto 5.2'!$M$19","v":0}]
["5207100","$M$21","Prospetto 5.2",false,"prospetto 5.2'!$M$21",{"$f":"'prospetto 5.2'!$M$21","v":0}]
["5203100","$O$15","Prospetto 5.2",false,"prospetto 5.2'!$O$15",{"$f":"'prospetto 5.2'!$O$15","v":0}]
["5203200","$O$16","Prospetto 5.2",false,"prospetto 5.2'!$O$16",{"$f":"'prospetto 5.2'!$O$16","v":0}]
["5203300","$O$17","Prospetto 5.2",false,"prospetto 5.2'!$O$17",{"$f":"'prospetto 5.2'!$O$17","v":0}]
["5203400","$O$18","Prospetto 5.2",false,"prospetto 5.2'!$O$18",{"$f":"'prospetto 5.2'!$O$18","v":0}]
["5203500","$O$19","Prospetto 5.2",true,"prospetto 5.2'!$O$19",{"$f":"'prospetto 5.2'!$O$19","v":0}]
["5207200","$O$21","Prospetto 5.2",false,"prospetto 5.2'!$O$21",{"$f":"'prospetto 5.2'!$O$21","v":0}]
["5203600","$Q$15","Prospetto 5.2",false,"prospetto 5.2'!$Q$15",{"$f":"'prospetto 5.2'!$Q$15","v":0}]
["5203700","$Q$16","Prospetto 5.2",false,"prospetto 5.2'!$Q$16",{"$f":"'prospetto 5.2'!$Q$16","v":0}]
["5203800","$Q$17","Prospetto 5.2",false,"prospetto 5.2'!$Q$17",{"$f":"'prospetto 5.2'!$Q$17","v":0}]
["5203900","$Q$18","Prospetto 5.2",false,"prospetto 5.2'!$Q$18",{"$f":"'prospetto 5.2'!$Q$18","v":0}]
["5204000","$Q$19","Prospetto 5.2",true,"prospetto 5.2'!$Q$19",{"$f":"'prospetto 5.2'!$Q$19","v":0}]
["5207300","$Q$21","Prospetto 5.2",false,"prospetto 5.2'!$Q$21",{"$f":"'prospetto 5.2'!$Q$21","v":0}]
["5204100","$S$15","Prospetto 5.2",false,"prospetto 5.2'!$S$15",{"$f":"'prospetto 5.2'!$S$15","v":0}]
["5204200","$S$16","Prospetto 5.2",false,"prospetto 5.2'!$S$16",{"$f":"'prospetto 5.2'!$S$16","v":0}]
["5204300","$S$17","Prospetto 5.2",false,"prospetto 5.2'!$S$17",{"$f":"'prospetto 5.2'!$S$17","v":0}]
["5204400","$S$18","Prospetto 5.2",false,"prospetto 5.2'!$S$18",{"$f":"'prospetto 5.2'!$S$18","v":0}]
["5204500","$S$19","Prospetto 5.2",true,"prospetto 5.2'!$S$19",{"$f":"'prospetto 5.2'!$S$19","v":0}]
["5207400","$S$21","Prospetto 5.2",false,"prospetto 5.2'!$S$21",{"$f":"'prospetto 5.2'!$S$21","v":0}]
["5204600","$U$15","Prospetto 5.2",false,"prospetto 5.2'!$U$15",{"$f":"'prospetto 5.2'!$U$15","v":0}]
["5204700","$U$16","Prospetto 5.2",false,"prospetto 5.2'!$U$16",{"$f":"'prospetto 5.2'!$U$16","v":0}]
["5204800","$U$17","Prospetto 5.2",false,"prospetto 5.2'!$U$17",{"$f":"'prospetto 5.2'!$U$17","v":0}]
["5204900","$U$18","Prospetto 5.2",false,"prospetto 5.2'!$U$18",{"$f":"'prospetto 5.2'!$U$18","v":0}]
["5205000","$U$19","Prospetto 5.2",true,"prospetto 5.2'!$U$19",{"$f":"'prospetto 5.2'!$U$19","v":0}]
["5207500","$U$21","Prospetto 5.2",false,"prospetto 5.2'!$U$21",{"$f":"'prospetto 5.2'!$U$21","v":0}]
["5205100","$W$15","Prospetto 5.2",false,"prospetto 5.2'!$W$15",{"$f":"'prospetto 5.2'!$W$15","v":0}]
["5205200","$W$16","Prospetto 5.2",false,"prospetto 5.2'!$W$16",{"$f":"'prospetto 5.2'!$W$16","v":0}]
["5205300","$W$17","Prospetto 5.2",false,"prospetto 5.2'!$W$17",{"$f":"'prospetto 5.2'!$W$17","v":0}]
["5205400","$W$18","Prospetto 5.2",false,"prospetto 5.2'!$W$18",{"$f":"'prospetto 5.2'!$W$18","v":0}]
["5205500","$W$19","Prospetto 5.2",true,"prospetto 5.2'!$W$19",{"$f":"'prospetto 5.2'!$W$19","v":0}]
["5207600","$W$21","Prospetto 5.2",false,"prospetto 5.2'!$W$21",{"$f":"'prospetto 5.2'!$W$21","v":0}]
["5205600","$Y$15","Prospetto 5.2",false,"prospetto 5.2'!$Y$15",{"$f":"'prospetto 5.2'!$Y$15","v":0}]
["5205700","$Y$16","Prospetto 5.2",false,"prospetto 5.2'!$Y$16",{"$f":"'prospetto 5.2'!$Y$16","v":0}]
["5205800","$Y$17","Prospetto 5.2",false,"prospetto 5.2'!$Y$17",{"$f":"'prospetto 5.2'!$Y$17","v":0}]
["5205900","$Y$18","Prospetto 5.2",false,"prospetto 5.2'!$Y$18",{"$f":"'prospetto 5.2'!$Y$18","v":0}]
["5206000","$Y$19","Prospetto 5.2",true,"prospetto 5.2'!$Y$19",{"$f":"'prospetto 5.2'!$Y$19","v":0}]
["5207700","$Y$21","Prospetto 5.2",false,"prospetto 5.2'!$Y$21",{"$f":"'prospetto 5.2'!$Y$21","v":0}]
["5206100","$AA$15","Prospetto 5.2",false,"prospetto 5.2'!$AA$15",{"$f":"'prospetto 5.2'!$AA$15","v":0}]
["5206200","$AA$16","Prospetto 5.2",false,"prospetto 5.2'!$AA$16",{"$f":"'prospetto 5.2'!$AA$16","v":0}]
["5206300","$AA$17","Prospetto 5.2",false,"prospetto 5.2'!$AA$17",{"$f":"'prospetto 5.2'!$AA$17","v":0}]
["5206400","$AA$18","Prospetto 5.2",false,"prospetto 5.2'!$AA$18",{"$f":"'prospetto 5.2'!$AA$18","v":0}]
["5206500","$AA$19","Prospetto 5.2",true,"prospetto 5.2'!$AA$19",{"$f":"'prospetto 5.2'!$AA$19","v":0}]
["5207800","$AA$21","Prospetto 5.2",false,"prospetto 5.2'!$AA$21",{"$f":"'prospetto 5.2'!$AA$21","v":0}]
["5300100","$C$10","Prospetto 5.3a",false,"prospetto 5.3a'!$C$10",{"$f":"'prospetto 5.3a'!$C$10","v":0}]
["5300200","$C$11","Prospetto 5.3a",false,"prospetto 5.3a'!$C$11",{"$f":"'prospetto 5.3a'!$C$11","v":0}]
["5300300","$C$12","Prospetto 5.3a",false,"prospetto 5.3a'!$C$12",{"$f":"'prospetto 5.3a'!$C$12","v":0}]
["5300400","$C$13","Prospetto 5.3a",false,"prospetto 5.3a'!$C$13",{"$f":"'prospetto 5.3a'!$C$13","v":0}]
["5300500","$C$14","Prospetto 5.3a",false,"prospetto 5.3a'!$C$14",{"$f":"'prospetto 5.3a'!$C$14","v":0}]
["5300600","$C$15","Prospetto 5.3a",false,"prospetto 5.3a'!$C$15",{"$f":"'prospetto 5.3a'!$C$15","v":0}]
["5300700","$C$16","Prospetto 5.3a",false,"prospetto 5.3a'!$C$16",{"$f":"'prospetto 5.3a'!$C$16","v":0}]
["5300800","$C$17","Prospetto 5.3a",false,"prospetto 5.3a'!$C$17",{"$f":"'prospetto 5.3a'!$C$17","v":0}]
["5300900","$C$18","Prospetto 5.3a",false,"prospetto 5.3a'!$C$18",{"$f":"'prospetto 5.3a'!$C$18","v":0}]
["5301000","$C$19","Prospetto 5.3a",false,"prospetto 5.3a'!$C$19",{"$f":"'prospetto 5.3a'!$C$19","v":0}]
["5301100","$C$20","Prospetto 5.3a",false,"prospetto 5.3a'!$C$20",{"$f":"'prospetto 5.3a'!$C$20","v":0}]
["5301200","$C$21","Prospetto 5.3a",false,"prospetto 5.3a'!$C$21",{"$f":"'prospetto 5.3a'!$C$21","v":0}]
["5301300","$C$22","Prospetto 5.3a",true,"prospetto 5.3a'!$C$22",{"$f":"'prospetto 5.3a'!$C$22","v":0}]
["5301400","$C$23","Prospetto 5.3a",false,"prospetto 5.3a'!$C$23",{"$f":"'prospetto 5.3a'!$C$23","v":0}]
["5301500","$C$24","Prospetto 5.3a",true,"prospetto 5.3a'!$C$24",{"$f":"'prospetto 5.3a'!$C$24","v":0}]
["5301600","$E$10","Prospetto 5.3a",false,"prospetto 5.3a'!$E$10",{"$f":"'prospetto 5.3a'!$E$10","v":0}]
["5301700","$E$11","Prospetto 5.3a",false,"prospetto 5.3a'!$E$11",{"$f":"'prospetto 5.3a'!$E$11","v":0}]
["5301800","$E$12","Prospetto 5.3a",false,"prospetto 5.3a'!$E$12",{"$f":"'prospetto 5.3a'!$E$12","v":0}]
["5301900","$E$13","Prospetto 5.3a",false,"prospetto 5.3a'!$E$13",{"$f":"'prospetto 5.3a'!$E$13","v":0}]
["5302000","$E$14","Prospetto 5.3a",false,"prospetto 5.3a'!$E$14",{"$f":"'prospetto 5.3a'!$E$14","v":0}]
["5302100","$E$15","Prospetto 5.3a",false,"prospetto 5.3a'!$E$15",{"$f":"'prospetto 5.3a'!$E$15","v":0}]
["5302200","$E$16","Prospetto 5.3a",false,"prospetto 5.3a'!$E$16",{"$f":"'prospetto 5.3a'!$E$16","v":0}]
["5302300","$E$17","Prospetto 5.3a",false,"prospetto 5.3a'!$E$17",{"$f":"'prospetto 5.3a'!$E$17","v":0}]
["5302400","$E$18","Prospetto 5.3a",false,"prospetto 5.3a'!$E$18",{"$f":"'prospetto 5.3a'!$E$18","v":0}]
["5302500","$E$19","Prospetto 5.3a",false,"prospetto 5.3a'!$E$19",{"$f":"'prospetto 5.3a'!$E$19","v":0}]
["5302600","$E$20","Prospetto 5.3a",false,"prospetto 5.3a'!$E$20",{"$f":"'prospetto 5.3a'!$E$20","v":0}]
["5302700","$E$21","Prospetto 5.3a",false,"prospetto 5.3a'!$E$21",{"$f":"'prospetto 5.3a'!$E$21","v":0}]
["5302800","$E$22","Prospetto 5.3a",true,"prospetto 5.3a'!$E$22",{"$f":"'prospetto 5.3a'!$E$22","v":0}]
["5302900","$E$23","Prospetto 5.3a",false,"prospetto 5.3a'!$E$23",{"$f":"'prospetto 5.3a'!$E$23","v":0}]
["5303000","$E$24","Prospetto 5.3a",true,"prospetto 5.3a'!$E$24",{"$f":"'prospetto 5.3a'!$E$24","v":0}]
["5303100","$G$10","Prospetto 5.3a",false,"prospetto 5.3a'!$G$10",{"$f":"'prospetto 5.3a'!$G$10","v":0}]
["5303200","$G$11","Prospetto 5.3a",false,"prospetto 5.3a'!$G$11",{"$f":"'prospetto 5.3a'!$G$11","v":0}]
["5303300","$G$12","Prospetto 5.3a",false,"prospetto 5.3a'!$G$12",{"$f":"'prospetto 5.3a'!$G$12","v":0}]
["5303400","$G$13","Prospetto 5.3a",false,"prospetto 5.3a'!$G$13",{"$f":"'prospetto 5.3a'!$G$13","v":0}]
["5303500","$G$14","Prospetto 5.3a",false,"prospetto 5.3a'!$G$14",{"$f":"'prospetto 5.3a'!$G$14","v":0}]
["5303600","$G$15","Prospetto 5.3a",false,"prospetto 5.3a'!$G$15",{"$f":"'prospetto 5.3a'!$G$15","v":0}]
["5303700","$G$16","Prospetto 5.3a",false,"prospetto 5.3a'!$G$16",{"$f":"'prospetto 5.3a'!$G$16","v":0}]
["5303800","$G$17","Prospetto 5.3a",false,"prospetto 5.3a'!$G$17",{"$f":"'prospetto 5.3a'!$G$17","v":0}]
["5303900","$G$18","Prospetto 5.3a",false,"prospetto 5.3a'!$G$18",{"$f":"'prospetto 5.3a'!$G$18","v":0}]
["5304000","$G$19","Prospetto 5.3a",false,"prospetto 5.3a'!$G$19",{"$f":"'prospetto 5.3a'!$G$19","v":0}]
["5304100","$G$20","Prospetto 5.3a",false,"prospetto 5.3a'!$G$20",{"$f":"'prospetto 5.3a'!$G$20","v":0}]
["5304200","$G$21","Prospetto 5.3a",false,"prospetto 5.3a'!$G$21",{"$f":"'prospetto 5.3a'!$G$21","v":0}]
["5304300","$G$22","Prospetto 5.3a",true,"prospetto 5.3a'!$G$22",{"$f":"'prospetto 5.3a'!$G$22","v":0}]
["5304400","$G$23","Prospetto 5.3a",false,"prospetto 5.3a'!$G$23",{"$f":"'prospetto 5.3a'!$G$23","v":0}]
["5304500","$G$24","Prospetto 5.3a",true,"prospetto 5.3a'!$G$24",{"$f":"'prospetto 5.3a'!$G$24","v":0}]
["5304600","$I$10","Prospetto 5.3a",false,"prospetto 5.3a'!$I$10",{"$f":"'prospetto 5.3a'!$I$10","v":0}]
["5304700","$I$11","Prospetto 5.3a",false,"prospetto 5.3a'!$I$11",{"$f":"'prospetto 5.3a'!$I$11","v":0}]
["5304800","$I$12","Prospetto 5.3a",false,"prospetto 5.3a'!$I$12",{"$f":"'prospetto 5.3a'!$I$12","v":0}]
["5304900","$I$13","Prospetto 5.3a",false,"prospetto 5.3a'!$I$13",{"$f":"'prospetto 5.3a'!$I$13","v":0}]
["5305000","$I$14","Prospetto 5.3a",false,"prospetto 5.3a'!$I$14",{"$f":"'prospetto 5.3a'!$I$14","v":0}]
["5305100","$I$15","Prospetto 5.3a",false,"prospetto 5.3a'!$I$15",{"$f":"'prospetto 5.3a'!$I$15","v":0}]
["5305200","$I$16","Prospetto 5.3a",false,"prospetto 5.3a'!$I$16",{"$f":"'prospetto 5.3a'!$I$16","v":0}]
["5305300","$I$17","Prospetto 5.3a",false,"prospetto 5.3a'!$I$17",{"$f":"'prospetto 5.3a'!$I$17","v":0}]
["5305400","$I$18","Prospetto 5.3a",false,"prospetto 5.3a'!$I$18",{"$f":"'prospetto 5.3a'!$I$18","v":0}]
["5305500","$I$19","Prospetto 5.3a",false,"prospetto 5.3a'!$I$19",{"$f":"'prospetto 5.3a'!$I$19","v":0}]
["5305600","$I$20","Prospetto 5.3a",false,"prospetto 5.3a'!$I$20",{"$f":"'prospetto 5.3a'!$I$20","v":0}]
["5305700","$I$21","Prospetto 5.3a",false,"prospetto 5.3a'!$I$21",{"$f":"'prospetto 5.3a'!$I$21","v":0}]
["5305800","$I$22","Prospetto 5.3a",true,"prospetto 5.3a'!$I$22",{"$f":"'prospetto 5.3a'!$I$22","v":0}]
["5305900","$I$23","Prospetto 5.3a",false,"prospetto 5.3a'!$I$23",{"$f":"'prospetto 5.3a'!$I$23","v":0}]
["5306000","$I$24","Prospetto 5.3a",true,"prospetto 5.3a'!$I$24",{"$f":"'prospetto 5.3a'!$I$24","v":0}]
["5306100","$K$10","Prospetto 5.3a",false,"prospetto 5.3a'!$K$10",{"$f":"'prospetto 5.3a'!$K$10","v":0}]
["5306200","$K$11","Prospetto 5.3a",false,"prospetto 5.3a'!$K$11",{"$f":"'prospetto 5.3a'!$K$11","v":0}]
["5306300","$K$12","Prospetto 5.3a",false,"prospetto 5.3a'!$K$12",{"$f":"'prospetto 5.3a'!$K$12","v":0}]
["5306400","$K$13","Prospetto 5.3a",false,"prospetto 5.3a'!$K$13",{"$f":"'prospetto 5.3a'!$K$13","v":0}]
["5306500","$K$14","Prospetto 5.3a",false,"prospetto 5.3a'!$K$14",{"$f":"'prospetto 5.3a'!$K$14","v":0}]
["5306600","$K$15","Prospetto 5.3a",false,"prospetto 5.3a'!$K$15",{"$f":"'prospetto 5.3a'!$K$15","v":0}]
["5306700","$K$16","Prospetto 5.3a",false,"prospetto 5.3a'!$K$16",{"$f":"'prospetto 5.3a'!$K$16","v":0}]
["5306800","$K$17","Prospetto 5.3a",false,"prospetto 5.3a'!$K$17",{"$f":"'prospetto 5.3a'!$K$17","v":0}]
["5306900","$K$18","Prospetto 5.3a",false,"prospetto 5.3a'!$K$18",{"$f":"'prospetto 5.3a'!$K$18","v":0}]
["5307000","$K$19","Prospetto 5.3a",false,"prospetto 5.3a'!$K$19",{"$f":"'prospetto 5.3a'!$K$19","v":0}]
["5307100","$K$20","Prospetto 5.3a",false,"prospetto 5.3a'!$K$20",{"$f":"'prospetto 5.3a'!$K$20","v":0}]
["5307200","$K$21","Prospetto 5.3a",false,"prospetto 5.3a'!$K$21",{"$f":"'prospetto 5.3a'!$K$21","v":0}]
["5307300","$K$22","Prospetto 5.3a",true,"prospetto 5.3a'!$K$22",{"$f":"'prospetto 5.3a'!$K$22","v":0}]
["5307400","$K$23","Prospetto 5.3a",false,"prospetto 5.3a'!$K$23",{"$f":"'prospetto 5.3a'!$K$23","v":0}]
["5307500","$K$24","Prospetto 5.3a",true,"prospetto 5.3a'!$K$24",{"$f":"'prospetto 5.3a'!$K$24","v":0}]
["5307600","$M$10","Prospetto 5.3a",false,"prospetto 5.3a'!$M$10",{"$f":"'prospetto 5.3a'!$M$10","v":0}]
["5307700","$M$11","Prospetto 5.3a",false,"prospetto 5.3a'!$M$11",{"$f":"'prospetto 5.3a'!$M$11","v":0}]
["5307800","$M$12","Prospetto 5.3a",false,"prospetto 5.3a'!$M$12",{"$f":"'prospetto 5.3a'!$M$12","v":0}]
["5307900","$M$13","Prospetto 5.3a",false,"prospetto 5.3a'!$M$13",{"$f":"'prospetto 5.3a'!$M$13","v":0}]
["5308000","$M$14","Prospetto 5.3a",false,"prospetto 5.3a'!$M$14",{"$f":"'prospetto 5.3a'!$M$14","v":0}]
["5308100","$M$15","Prospetto 5.3a",false,"prospetto 5.3a'!$M$15",{"$f":"'prospetto 5.3a'!$M$15","v":0}]
["5308200","$M$16","Prospetto 5.3a",false,"prospetto 5.3a'!$M$16",{"$f":"'prospetto 5.3a'!$M$16","v":0}]
["5308300","$M$17","Prospetto 5.3a",false,"prospetto 5.3a'!$M$17",{"$f":"'prospetto 5.3a'!$M$17","v":0}]
["5308400","$M$18","Prospetto 5.3a",false,"prospetto 5.3a'!$M$18",{"$f":"'prospetto 5.3a'!$M$18","v":0}]
["5308500","$M$19","Prospetto 5.3a",false,"prospetto 5.3a'!$M$19",{"$f":"'prospetto 5.3a'!$M$19","v":0}]
["5308600","$M$20","Prospetto 5.3a",false,"prospetto 5.3a'!$M$20",{"$f":"'prospetto 5.3a'!$M$20","v":0}]
["5308700","$M$21","Prospetto 5.3a",false,"prospetto 5.3a'!$M$21",{"$f":"'prospetto 5.3a'!$M$21","v":0}]
["5308800","$M$22","Prospetto 5.3a",true,"prospetto 5.3a'!$M$22",{"$f":"'prospetto 5.3a'!$M$22","v":0}]
["5308900","$M$23","Prospetto 5.3a",false,"prospetto 5.3a'!$M$23",{"$f":"'prospetto 5.3a'!$M$23","v":0}]
["5309000","$M$24","Prospetto 5.3a",true,"prospetto 5.3a'!$M$24",{"$f":"'prospetto 5.3a'!$M$24","v":0}]
["5309100","$O$10","Prospetto 5.3a",false,"prospetto 5.3a'!$O$10",{"$f":"'prospetto 5.3a'!$O$10","v":0}]
["5309200","$O$11","Prospetto 5.3a",false,"prospetto 5.3a'!$O$11",{"$f":"'prospetto 5.3a'!$O$11","v":0}]
["5309300","$O$12","Prospetto 5.3a",false,"prospetto 5.3a'!$O$12",{"$f":"'prospetto 5.3a'!$O$12","v":0}]
["5309400","$O$13","Prospetto 5.3a",false,"prospetto 5.3a'!$O$13",{"$f":"'prospetto 5.3a'!$O$13","v":0}]
["5309500","$O$14","Prospetto 5.3a",false,"prospetto 5.3a'!$O$14",{"$f":"'prospetto 5.3a'!$O$14","v":0}]
["5309600","$O$15","Prospetto 5.3a",false,"prospetto 5.3a'!$O$15",{"$f":"'prospetto 5.3a'!$O$15","v":0}]
["5309700","$O$16","Prospetto 5.3a",false,"prospetto 5.3a'!$O$16",{"$f":"'prospetto 5.3a'!$O$16","v":0}]
["5309800","$O$17","Prospetto 5.3a",false,"prospetto 5.3a'!$O$17",{"$f":"'prospetto 5.3a'!$O$17","v":0}]
["5309900","$O$18","Prospetto 5.3a",false,"prospetto 5.3a'!$O$18",{"$f":"'prospetto 5.3a'!$O$18","v":0}]
["5310000","$O$19","Prospetto 5.3a",false,"prospetto 5.3a'!$O$19",{"$f":"'prospetto 5.3a'!$O$19","v":0}]
["5310100","$O$20","Prospetto 5.3a",false,"prospetto 5.3a'!$O$20",{"$f":"'prospetto 5.3a'!$O$20","v":0}]
["5310200","$O$21","Prospetto 5.3a",false,"prospetto 5.3a'!$O$21",{"$f":"'prospetto 5.3a'!$O$21","v":0}]
["5310300","$O$22","Prospetto 5.3a",true,"prospetto 5.3a'!$O$22",{"$f":"'prospetto 5.3a'!$O$22","v":0}]
["5310400","$O$23","Prospetto 5.3a",false,"prospetto 5.3a'!$O$23",{"$f":"'prospetto 5.3a'!$O$23","v":0}]
["5310500","$O$24","Prospetto 5.3a",true,"prospetto 5.3a'!$O$24",{"$f":"'prospetto 5.3a'!$O$24","v":0}]
["5310600","$Q$10","Prospetto 5.3a",false,"prospetto 5.3a'!$Q$10",{"$f":"'prospetto 5.3a'!$Q$10","v":0}]
["5310700","$Q$11","Prospetto 5.3a",false,"prospetto 5.3a'!$Q$11",{"$f":"'prospetto 5.3a'!$Q$11","v":0}]
["5310800","$Q$12","Prospetto 5.3a",false,"prospetto 5.3a'!$Q$12",{"$f":"'prospetto 5.3a'!$Q$12","v":0}]
["5310900","$Q$13","Prospetto 5.3a",false,"prospetto 5.3a'!$Q$13",{"$f":"'prospetto 5.3a'!$Q$13","v":0}]
["5311000","$Q$14","Prospetto 5.3a",false,"prospetto 5.3a'!$Q$14",{"$f":"'prospetto 5.3a'!$Q$14","v":0}]
["5311100","$Q$15","Prospetto 5.3a",false,"prospetto 5.3a'!$Q$15",{"$f":"'prospetto 5.3a'!$Q$15","v":0}]
["5311200","$Q$16","Prospetto 5.3a",false,"prospetto 5.3a'!$Q$16",{"$f":"'prospetto 5.3a'!$Q$16","v":0}]
["5311300","$Q$17","Prospetto 5.3a",false,"prospetto 5.3a'!$Q$17",{"$f":"'prospetto 5.3a'!$Q$17","v":0}]
["5311400","$Q$18","Prospetto 5.3a",false,"prospetto 5.3a'!$Q$18",{"$f":"'prospetto 5.3a'!$Q$18","v":0}]
["5311500","$Q$19","Prospetto 5.3a",false,"prospetto 5.3a'!$Q$19",{"$f":"'prospetto 5.3a'!$Q$19","v":0}]
["5311600","$Q$20","Prospetto 5.3a",false,"prospetto 5.3a'!$Q$20",{"$f":"'prospetto 5.3a'!$Q$20","v":0}]
["5311700","$Q$21","Prospetto 5.3a",false,"prospetto 5.3a'!$Q$21",{"$f":"'prospetto 5.3a'!$Q$21","v":0}]
["5311800","$Q$22","Prospetto 5.3a",true,"prospetto 5.3a'!$Q$22",{"$f":"'prospetto 5.3a'!$Q$22","v":0}]
["5311900","$Q$23","Prospetto 5.3a",false,"prospetto 5.3a'!$Q$23",{"$f":"'prospetto 5.3a'!$Q$23","v":0}]
["5312000","$Q$24","Prospetto 5.3a",true,"prospetto 5.3a'!$Q$24",{"$f":"'prospetto 5.3a'!$Q$24","v":0}]
["5312100","$S$10","Prospetto 5.3a",false,"prospetto 5.3a'!$S$10",{"$f":"'prospetto 5.3a'!$S$10","v":0}]
["5312200","$S$11","Prospetto 5.3a",false,"prospetto 5.3a'!$S$11",{"$f":"'prospetto 5.3a'!$S$11","v":0}]
["5312300","$S$12","Prospetto 5.3a",false,"prospetto 5.3a'!$S$12",{"$f":"'prospetto 5.3a'!$S$12","v":0}]
["5312400","$S$13","Prospetto 5.3a",false,"prospetto 5.3a'!$S$13",{"$f":"'prospetto 5.3a'!$S$13","v":0}]
["5312500","$S$14","Prospetto 5.3a",false,"prospetto 5.3a'!$S$14",{"$f":"'prospetto 5.3a'!$S$14","v":0}]
["5312600","$S$15","Prospetto 5.3a",false,"prospetto 5.3a'!$S$15",{"$f":"'prospetto 5.3a'!$S$15","v":0}]
["5312700","$S$16","Prospetto 5.3a",false,"prospetto 5.3a'!$S$16",{"$f":"'prospetto 5.3a'!$S$16","v":0}]
["5312800","$S$17","Prospetto 5.3a",false,"prospetto 5.3a'!$S$17",{"$f":"'prospetto 5.3a'!$S$17","v":0}]
["5312900","$S$18","Prospetto 5.3a",false,"prospetto 5.3a'!$S$18",{"$f":"'prospetto 5.3a'!$S$18","v":0}]
["5313000","$S$19","Prospetto 5.3a",false,"prospetto 5.3a'!$S$19",{"$f":"'prospetto 5.3a'!$S$19","v":0}]
["5313100","$S$20","Prospetto 5.3a",false,"prospetto 5.3a'!$S$20",{"$f":"'prospetto 5.3a'!$S$20","v":0}]
["5313200","$S$21","Prospetto 5.3a",false,"prospetto 5.3a'!$S$21",{"$f":"'prospetto 5.3a'!$S$21","v":0}]
["5313300","$S$22","Prospetto 5.3a",true,"prospetto 5.3a'!$S$22",{"$f":"'prospetto 5.3a'!$S$22","v":0}]
["5313400","$S$23","Prospetto 5.3a",false,"prospetto 5.3a'!$S$23",{"$f":"'prospetto 5.3a'!$S$23","v":0}]
["5313500","$S$24","Prospetto 5.3a",true,"prospetto 5.3a'!$S$24",{"$f":"'prospetto 5.3a'!$S$24","v":0}]
["5313600","$U$10","Prospetto 5.3a",false,"prospetto 5.3a'!$U$10",{"$f":"'prospetto 5.3a'!$U$10","v":0}]
["5313700","$U$11","Prospetto 5.3a",false,"prospetto 5.3a'!$U$11",{"$f":"'prospetto 5.3a'!$U$11","v":0}]
["5313800","$U$12","Prospetto 5.3a",false,"prospetto 5.3a'!$U$12",{"$f":"'prospetto 5.3a'!$U$12","v":0}]
["5313900","$U$13","Prospetto 5.3a",false,"prospetto 5.3a'!$U$13",{"$f":"'prospetto 5.3a'!$U$13","v":0}]
["5314000","$U$14","Prospetto 5.3a",false,"prospetto 5.3a'!$U$14",{"$f":"'prospetto 5.3a'!$U$14","v":0}]
["5314100","$U$15","Prospetto 5.3a",false,"prospetto 5.3a'!$U$15",{"$f":"'prospetto 5.3a'!$U$15","v":0}]
["5314200","$U$16","Prospetto 5.3a",false,"prospetto 5.3a'!$U$16",{"$f":"'prospetto 5.3a'!$U$16","v":0}]
["5314300","$U$17","Prospetto 5.3a",false,"prospetto 5.3a'!$U$17",{"$f":"'prospetto 5.3a'!$U$17","v":0}]
["5314400","$U$18","Prospetto 5.3a",false,"prospetto 5.3a'!$U$18",{"$f":"'prospetto 5.3a'!$U$18","v":0}]
["5314500","$U$19","Prospetto 5.3a",false,"prospetto 5.3a'!$U$19",{"$f":"'prospetto 5.3a'!$U$19","v":0}]
["5314600","$U$20","Prospetto 5.3a",false,"prospetto 5.3a'!$U$20",{"$f":"'prospetto 5.3a'!$U$20","v":0}]
["5314700","$U$21","Prospetto 5.3a",false,"prospetto 5.3a'!$U$21",{"$f":"'prospetto 5.3a'!$U$21","v":0}]
["5314800","$U$22","Prospetto 5.3a",true,"prospetto 5.3a'!$U$22",{"$f":"'prospetto 5.3a'!$U$22","v":0}]
["5314900","$U$23","Prospetto 5.3a",false,"prospetto 5.3a'!$U$23",{"$f":"'prospetto 5.3a'!$U$23","v":0}]
["5315000","$U$24","Prospetto 5.3a",true,"prospetto 5.3a'!$U$24",{"$f":"'prospetto 5.3a'!$U$24","v":0}]
["5315100","$W$10","Prospetto 5.3a",false,"prospetto 5.3a'!$W$10",{"$f":"'prospetto 5.3a'!$W$10","v":0}]
["5315200","$W$11","Prospetto 5.3a",false,"prospetto 5.3a'!$W$11",{"$f":"'prospetto 5.3a'!$W$11","v":0}]
["5315300","$W$12","Prospetto 5.3a",false,"prospetto 5.3a'!$W$12",{"$f":"'prospetto 5.3a'!$W$12","v":0}]
["5315400","$W$13","Prospetto 5.3a",false,"prospetto 5.3a'!$W$13",{"$f":"'prospetto 5.3a'!$W$13","v":0}]
["5315500","$W$14","Prospetto 5.3a",false,"prospetto 5.3a'!$W$14",{"$f":"'prospetto 5.3a'!$W$14","v":0}]
["5315600","$W$15","Prospetto 5.3a",false,"prospetto 5.3a'!$W$15",{"$f":"'prospetto 5.3a'!$W$15","v":0}]
["5315700","$W$16","Prospetto 5.3a",false,"prospetto 5.3a'!$W$16",{"$f":"'prospetto 5.3a'!$W$16","v":0}]
["5315800","$W$17","Prospetto 5.3a",false,"prospetto 5.3a'!$W$17",{"$f":"'prospetto 5.3a'!$W$17","v":0}]
["5315900","$W$18","Prospetto 5.3a",false,"prospetto 5.3a'!$W$18",{"$f":"'prospetto 5.3a'!$W$18","v":0}]
["5316000","$W$19","Prospetto 5.3a",false,"prospetto 5.3a'!$W$19",{"$f":"'prospetto 5.3a'!$W$19","v":0}]
["5316100","$W$20","Prospetto 5.3a",false,"prospetto 5.3a'!$W$20",{"$f":"'prospetto 5.3a'!$W$20","v":0}]
["5316200","$W$21","Prospetto 5.3a",false,"prospetto 5.3a'!$W$21",{"$f":"'prospetto 5.3a'!$W$21","v":0}]
["5316300","$W$22","Prospetto 5.3a",true,"prospetto 5.3a'!$W$22",{"$f":"'prospetto 5.3a'!$W$22","v":0}]
["5316400","$W$23","Prospetto 5.3a",false,"prospetto 5.3a'!$W$23",{"$f":"'prospetto 5.3a'!$W$23","v":0}]
["5316500","$W$24","Prospetto 5.3a",true,"prospetto 5.3a'!$W$24",{"$f":"'prospetto 5.3a'!$W$24","v":0}]
["5316600","$Y$10","Prospetto 5.3a",false,"prospetto 5.3a'!$Y$10",{"$f":"'prospetto 5.3a'!$Y$10","v":0}]
["5316700","$Y$11","Prospetto 5.3a",false,"prospetto 5.3a'!$Y$11",{"$f":"'prospetto 5.3a'!$Y$11","v":0}]
["5316800","$Y$12","Prospetto 5.3a",false,"prospetto 5.3a'!$Y$12",{"$f":"'prospetto 5.3a'!$Y$12","v":0}]
["5316900","$Y$13","Prospetto 5.3a",false,"prospetto 5.3a'!$Y$13",{"$f":"'prospetto 5.3a'!$Y$13","v":0}]
["5317000","$Y$14","Prospetto 5.3a",false,"prospetto 5.3a'!$Y$14",{"$f":"'prospetto 5.3a'!$Y$14","v":0}]
["5317100","$Y$15","Prospetto 5.3a",false,"prospetto 5.3a'!$Y$15",{"$f":"'prospetto 5.3a'!$Y$15","v":0}]
["5317200","$Y$16","Prospetto 5.3a",false,"prospetto 5.3a'!$Y$16",{"$f":"'prospetto 5.3a'!$Y$16","v":0}]
["5317300","$Y$17","Prospetto 5.3a",false,"prospetto 5.3a'!$Y$17",{"$f":"'prospetto 5.3a'!$Y$17","v":0}]
["5317400","$Y$18","Prospetto 5.3a",false,"prospetto 5.3a'!$Y$18",{"$f":"'prospetto 5.3a'!$Y$18","v":0}]
["5317500","$Y$19","Prospetto 5.3a",false,"prospetto 5.3a'!$Y$19",{"$f":"'prospetto 5.3a'!$Y$19","v":0}]
["5317600","$Y$20","Prospetto 5.3a",false,"prospetto 5.3a'!$Y$20",{"$f":"'prospetto 5.3a'!$Y$20","v":0}]
["5317700","$Y$21","Prospetto 5.3a",false,"prospetto 5.3a'!$Y$21",{"$f":"'prospetto 5.3a'!$Y$21","v":0}]
["5317800","$Y$22","Prospetto 5.3a",true,"prospetto 5.3a'!$Y$22",{"$f":"'prospetto 5.3a'!$Y$22","v":0}]
["5317900","$Y$23","Prospetto 5.3a",false,"prospetto 5.3a'!$Y$23",{"$f":"'prospetto 5.3a'!$Y$23","v":0}]
["5318000","$Y$24","Prospetto 5.3a",true,"prospetto 5.3a'!$Y$24",{"$f":"'prospetto 5.3a'!$Y$24","v":0}]
["5500100","$C$10","Prospetto 5.3b",false,"prospetto 5.3b'!$C$10",{"$f":"'prospetto 5.3b'!$C$10","v":0}]
["5500200","$C$11","Prospetto 5.3b",false,"prospetto 5.3b'!$C$11",{"$f":"'prospetto 5.3b'!$C$11","v":0}]
["5500300","$C$12","Prospetto 5.3b",false,"prospetto 5.3b'!$C$12",{"$f":"'prospetto 5.3b'!$C$12","v":0}]
["5500400","$C$13","Prospetto 5.3b",false,"prospetto 5.3b'!$C$13",{"$f":"'prospetto 5.3b'!$C$13","v":0}]
["5500500","$C$14","Prospetto 5.3b",false,"prospetto 5.3b'!$C$14",{"$f":"'prospetto 5.3b'!$C$14","v":0}]
["5500600","$C$15","Prospetto 5.3b",false,"prospetto 5.3b'!$C$15",{"$f":"'prospetto 5.3b'!$C$15","v":0}]
["5500700","$C$16","Prospetto 5.3b",false,"prospetto 5.3b'!$C$16",{"$f":"'prospetto 5.3b'!$C$16","v":0}]
["5500800","$C$17","Prospetto 5.3b",false,"prospetto 5.3b'!$C$17",{"$f":"'prospetto 5.3b'!$C$17","v":0}]
["5500900","$C$18","Prospetto 5.3b",false,"prospetto 5.3b'!$C$18",{"$f":"'prospetto 5.3b'!$C$18","v":0}]
["5501000","$C$19","Prospetto 5.3b",false,"prospetto 5.3b'!$C$19",{"$f":"'prospetto 5.3b'!$C$19","v":0}]
["5501100","$C$20","Prospetto 5.3b",false,"prospetto 5.3b'!$C$20",{"$f":"'prospetto 5.3b'!$C$20","v":0}]
["5501200","$C$21","Prospetto 5.3b",false,"prospetto 5.3b'!$C$21",{"$f":"'prospetto 5.3b'!$C$21","v":0}]
["5501300","$C$22","Prospetto 5.3b",true,"prospetto 5.3b'!$C$22",{"$f":"'prospetto 5.3b'!$C$22","v":0}]
["5501400","$C$23","Prospetto 5.3b",false,"prospetto 5.3b'!$C$23",{"$f":"'prospetto 5.3b'!$C$23","v":0}]
["5501500","$C$24","Prospetto 5.3b",true,"prospetto 5.3b'!$C$24",{"$f":"'prospetto 5.3b'!$C$24","v":0}]
["5501600","$E$10","Prospetto 5.3b",false,"prospetto 5.3b'!$E$10",{"$f":"'prospetto 5.3b'!$E$10","v":0}]
["5501700","$E$11","Prospetto 5.3b",false,"prospetto 5.3b'!$E$11",{"$f":"'prospetto 5.3b'!$E$11","v":0}]
["5501800","$E$12","Prospetto 5.3b",false,"prospetto 5.3b'!$E$12",{"$f":"'prospetto 5.3b'!$E$12","v":0}]
["5501900","$E$13","Prospetto 5.3b",false,"prospetto 5.3b'!$E$13",{"$f":"'prospetto 5.3b'!$E$13","v":0}]
["5502000","$E$14","Prospetto 5.3b",false,"prospetto 5.3b'!$E$14",{"$f":"'prospetto 5.3b'!$E$14","v":0}]
["5502100","$E$15","Prospetto 5.3b",false,"prospetto 5.3b'!$E$15",{"$f":"'prospetto 5.3b'!$E$15","v":0}]
["5502200","$E$16","Prospetto 5.3b",false,"prospetto 5.3b'!$E$16",{"$f":"'prospetto 5.3b'!$E$16","v":0}]
["5502300","$E$17","Prospetto 5.3b",false,"prospetto 5.3b'!$E$17",{"$f":"'prospetto 5.3b'!$E$17","v":0}]
["5502400","$E$18","Prospetto 5.3b",false,"prospetto 5.3b'!$E$18",{"$f":"'prospetto 5.3b'!$E$18","v":0}]
["5502500","$E$19","Prospetto 5.3b",false,"prospetto 5.3b'!$E$19",{"$f":"'prospetto 5.3b'!$E$19","v":0}]
["5502600","$E$20","Prospetto 5.3b",false,"prospetto 5.3b'!$E$20",{"$f":"'prospetto 5.3b'!$E$20","v":0}]
["5502700","$E$21","Prospetto 5.3b",false,"prospetto 5.3b'!$E$21",{"$f":"'prospetto 5.3b'!$E$21","v":0}]
["5502800","$E$22","Prospetto 5.3b",true,"prospetto 5.3b'!$E$22",{"$f":"'prospetto 5.3b'!$E$22","v":0}]
["5502900","$E$23","Prospetto 5.3b",false,"prospetto 5.3b'!$E$23",{"$f":"'prospetto 5.3b'!$E$23","v":0}]
["5503000","$E$24","Prospetto 5.3b",true,"prospetto 5.3b'!$E$24",{"$f":"'prospetto 5.3b'!$E$24","v":0}]
["5503100","$G$10","Prospetto 5.3b",false,"prospetto 5.3b'!$G$10",{"$f":"'prospetto 5.3b'!$G$10","v":0}]
["5503200","$G$11","Prospetto 5.3b",false,"prospetto 5.3b'!$G$11",{"$f":"'prospetto 5.3b'!$G$11","v":0}]
["5503300","$G$12","Prospetto 5.3b",false,"prospetto 5.3b'!$G$12",{"$f":"'prospetto 5.3b'!$G$12","v":0}]
["5503400","$G$13","Prospetto 5.3b",false,"prospetto 5.3b'!$G$13",{"$f":"'prospetto 5.3b'!$G$13","v":0}]
["5503500","$G$14","Prospetto 5.3b",false,"prospetto 5.3b'!$G$14",{"$f":"'prospetto 5.3b'!$G$14","v":0}]
["5503600","$G$15","Prospetto 5.3b",false,"prospetto 5.3b'!$G$15",{"$f":"'prospetto 5.3b'!$G$15","v":0}]
["5503700","$G$16","Prospetto 5.3b",false,"prospetto 5.3b'!$G$16",{"$f":"'prospetto 5.3b'!$G$16","v":0}]
["5503800","$G$17","Prospetto 5.3b",false,"prospetto 5.3b'!$G$17",{"$f":"'prospetto 5.3b'!$G$17","v":0}]
["5503900","$G$18","Prospetto 5.3b",false,"prospetto 5.3b'!$G$18",{"$f":"'prospetto 5.3b'!$G$18","v":0}]
["5504000","$G$19","Prospetto 5.3b",false,"prospetto 5.3b'!$G$19",{"$f":"'prospetto 5.3b'!$G$19","v":0}]
["5504100","$G$20","Prospetto 5.3b",false,"prospetto 5.3b'!$G$20",{"$f":"'prospetto 5.3b'!$G$20","v":0}]
["5504200","$G$21","Prospetto 5.3b",false,"prospetto 5.3b'!$G$21",{"$f":"'prospetto 5.3b'!$G$21","v":0}]
["5504300","$G$22","Prospetto 5.3b",true,"prospetto 5.3b'!$G$22",{"$f":"'prospetto 5.3b'!$G$22","v":0}]
["5504400","$G$23","Prospetto 5.3b",false,"prospetto 5.3b'!$G$23",{"$f":"'prospetto 5.3b'!$G$23","v":0}]
["5504500","$G$24","Prospetto 5.3b",true,"prospetto 5.3b'!$G$24",{"$f":"'prospetto 5.3b'!$G$24","v":0}]
["5504600","$I$10","Prospetto 5.3b",false,"prospetto 5.3b'!$I$10",{"$f":"'prospetto 5.3b'!$I$10","v":0}]
["5504700","$I$11","Prospetto 5.3b",false,"prospetto 5.3b'!$I$11",{"$f":"'prospetto 5.3b'!$I$11","v":0}]
["5504800","$I$12","Prospetto 5.3b",false,"prospetto 5.3b'!$I$12",{"$f":"'prospetto 5.3b'!$I$12","v":0}]
["5504900","$I$13","Prospetto 5.3b",false,"prospetto 5.3b'!$I$13",{"$f":"'prospetto 5.3b'!$I$13","v":0}]
["5505000","$I$14","Prospetto 5.3b",false,"prospetto 5.3b'!$I$14",{"$f":"'prospetto 5.3b'!$I$14","v":0}]
["5505100","$I$15","Prospetto 5.3b",false,"prospetto 5.3b'!$I$15",{"$f":"'prospetto 5.3b'!$I$15","v":0}]
["5505200","$I$16","Prospetto 5.3b",false,"prospetto 5.3b'!$I$16",{"$f":"'prospetto 5.3b'!$I$16","v":0}]
["5505300","$I$17","Prospetto 5.3b",false,"prospetto 5.3b'!$I$17",{"$f":"'prospetto 5.3b'!$I$17","v":0}]
["5505400","$I$18","Prospetto 5.3b",false,"prospetto 5.3b'!$I$18",{"$f":"'prospetto 5.3b'!$I$18","v":0}]
["5505500","$I$19","Prospetto 5.3b",false,"prospetto 5.3b'!$I$19",{"$f":"'prospetto 5.3b'!$I$19","v":0}]
["5505600","$I$20","Prospetto 5.3b",false,"prospetto 5.3b'!$I$20",{"$f":"'prospetto 5.3b'!$I$20","v":0}]
["5505700","$I$21","Prospetto 5.3b",false,"prospetto 5.3b'!$I$21",{"$f":"'prospetto 5.3b'!$I$21","v":0}]
["5505800","$I$22","Prospetto 5.3b",true,"prospetto 5.3b'!$I$22",{"$f":"'prospetto 5.3b'!$I$22","v":0}]
["5505900","$I$23","Prospetto 5.3b",false,"prospetto 5.3b'!$I$23",{"$f":"'prospetto 5.3b'!$I$23","v":0}]
["5506000","$I$24","Prospetto 5.3b",true,"prospetto 5.3b'!$I$24",{"$f":"'prospetto 5.3b'!$I$24","v":0}]
["5506100","$K$10","Prospetto 5.3b",false,"prospetto 5.3b'!$K$10",{"$f":"'prospetto 5.3b'!$K$10","v":0}]
["5506200","$K$11","Prospetto 5.3b",false,"prospetto 5.3b'!$K$11",{"$f":"'prospetto 5.3b'!$K$11","v":0}]
["5506300","$K$12","Prospetto 5.3b",false,"prospetto 5.3b'!$K$12",{"$f":"'prospetto 5.3b'!$K$12","v":0}]
["5506400","$K$13","Prospetto 5.3b",false,"prospetto 5.3b'!$K$13",{"$f":"'prospetto 5.3b'!$K$13","v":0}]
["5506500","$K$14","Prospetto 5.3b",false,"prospetto 5.3b'!$K$14",{"$f":"'prospetto 5.3b'!$K$14","v":0}]
["5506600","$K$15","Prospetto 5.3b",false,"prospetto 5.3b'!$K$15",{"$f":"'prospetto 5.3b'!$K$15","v":0}]
["5506700","$K$16","Prospetto 5.3b",false,"prospetto 5.3b'!$K$16",{"$f":"'prospetto 5.3b'!$K$16","v":0}]
["5506800","$K$17","Prospetto 5.3b",false,"prospetto 5.3b'!$K$17",{"$f":"'prospetto 5.3b'!$K$17","v":0}]
["5506900","$K$18","Prospetto 5.3b",false,"prospetto 5.3b'!$K$18",{"$f":"'prospetto 5.3b'!$K$18","v":0}]
["5507000","$K$19","Prospetto 5.3b",false,"prospetto 5.3b'!$K$19",{"$f":"'prospetto 5.3b'!$K$19","v":0}]
["5507100","$K$20","Prospetto 5.3b",false,"prospetto 5.3b'!$K$20",{"$f":"'prospetto 5.3b'!$K$20","v":0}]
["5507200","$K$21","Prospetto 5.3b",false,"prospetto 5.3b'!$K$21",{"$f":"'prospetto 5.3b'!$K$21","v":0}]
["5507300","$K$22","Prospetto 5.3b",true,"prospetto 5.3b'!$K$22",{"$f":"'prospetto 5.3b'!$K$22","v":0}]
["5507400","$K$23","Prospetto 5.3b",false,"prospetto 5.3b'!$K$23",{"$f":"'prospetto 5.3b'!$K$23","v":0}]
["5507500","$K$24","Prospetto 5.3b",true,"prospetto 5.3b'!$K$24",{"$f":"'prospetto 5.3b'!$K$24","v":0}]
["5507600","$M$10","Prospetto 5.3b",false,"prospetto 5.3b'!$M$10",{"$f":"'prospetto 5.3b'!$M$10","v":0}]
["5507700","$M$11","Prospetto 5.3b",false,"prospetto 5.3b'!$M$11",{"$f":"'prospetto 5.3b'!$M$11","v":0}]
["5507800","$M$12","Prospetto 5.3b",false,"prospetto 5.3b'!$M$12",{"$f":"'prospetto 5.3b'!$M$12","v":0}]
["5507900","$M$13","Prospetto 5.3b",false,"prospetto 5.3b'!$M$13",{"$f":"'prospetto 5.3b'!$M$13","v":0}]
["5508000","$M$14","Prospetto 5.3b",false,"prospetto 5.3b'!$M$14",{"$f":"'prospetto 5.3b'!$M$14","v":0}]
["5508100","$M$15","Prospetto 5.3b",false,"prospetto 5.3b'!$M$15",{"$f":"'prospetto 5.3b'!$M$15","v":0}]
["5508200","$M$16","Prospetto 5.3b",false,"prospetto 5.3b'!$M$16",{"$f":"'prospetto 5.3b'!$M$16","v":0}]
["5508300","$M$17","Prospetto 5.3b",false,"prospetto 5.3b'!$M$17",{"$f":"'prospetto 5.3b'!$M$17","v":0}]
["5508400","$M$18","Prospetto 5.3b",false,"prospetto 5.3b'!$M$18",{"$f":"'prospetto 5.3b'!$M$18","v":0}]
["5508500","$M$19","Prospetto 5.3b",false,"prospetto 5.3b'!$M$19",{"$f":"'prospetto 5.3b'!$M$19","v":0}]
["5508600","$M$20","Prospetto 5.3b",false,"prospetto 5.3b'!$M$20",{"$f":"'prospetto 5.3b'!$M$20","v":0}]
["5508700","$M$21","Prospetto 5.3b",false,"prospetto 5.3b'!$M$21",{"$f":"'prospetto 5.3b'!$M$21","v":0}]
["5508800","$M$22","Prospetto 5.3b",true,"prospetto 5.3b'!$M$22",{"$f":"'prospetto 5.3b'!$M$22","v":0}]
["5508900","$M$23","Prospetto 5.3b",false,"prospetto 5.3b'!$M$23",{"$f":"'prospetto 5.3b'!$M$23","v":0}]
["5509000","$M$24","Prospetto 5.3b",true,"prospetto 5.3b'!$M$24",{"$f":"'prospetto 5.3b'!$M$24","v":0}]
["5509100","$O$10","Prospetto 5.3b",false,"prospetto 5.3b'!$O$10",{"$f":"'prospetto 5.3b'!$O$10","v":0}]
["5509200","$O$11","Prospetto 5.3b",false,"prospetto 5.3b'!$O$11",{"$f":"'prospetto 5.3b'!$O$11","v":0}]
["5509300","$O$12","Prospetto 5.3b",false,"prospetto 5.3b'!$O$12",{"$f":"'prospetto 5.3b'!$O$12","v":0}]
["5509400","$O$13","Prospetto 5.3b",false,"prospetto 5.3b'!$O$13",{"$f":"'prospetto 5.3b'!$O$13","v":0}]
["5509500","$O$14","Prospetto 5.3b",false,"prospetto 5.3b'!$O$14",{"$f":"'prospetto 5.3b'!$O$14","v":0}]
["5509600","$O$15","Prospetto 5.3b",false,"prospetto 5.3b'!$O$15",{"$f":"'prospetto 5.3b'!$O$15","v":0}]
["5509700","$O$16","Prospetto 5.3b",false,"prospetto 5.3b'!$O$16",{"$f":"'prospetto 5.3b'!$O$16","v":0}]
["5509800","$O$17","Prospetto 5.3b",false,"prospetto 5.3b'!$O$17",{"$f":"'prospetto 5.3b'!$O$17","v":0}]
["5509900","$O$18","Prospetto 5.3b",false,"prospetto 5.3b'!$O$18",{"$f":"'prospetto 5.3b'!$O$18","v":0}]
["5510000","$O$19","Prospetto 5.3b",false,"prospetto 5.3b'!$O$19",{"$f":"'prospetto 5.3b'!$O$19","v":0}]
["5510100","$O$20","Prospetto 5.3b",false,"prospetto 5.3b'!$O$20",{"$f":"'prospetto 5.3b'!$O$20","v":0}]
["5510200","$O$21","Prospetto 5.3b",false,"prospetto 5.3b'!$O$21",{"$f":"'prospetto 5.3b'!$O$21","v":0}]
["5510300","$O$22","Prospetto 5.3b",true,"prospetto 5.3b'!$O$22",{"$f":"'prospetto 5.3b'!$O$22","v":0}]
["5510400","$O$23","Prospetto 5.3b",false,"prospetto 5.3b'!$O$23",{"$f":"'prospetto 5.3b'!$O$23","v":0}]
["5510500","$O$24","Prospetto 5.3b",true,"prospetto 5.3b'!$O$24",{"$f":"'prospetto 5.3b'!$O$24","v":0}]
["5510600","$Q$10","Prospetto 5.3b",false,"prospetto 5.3b'!$Q$10",{"$f":"'prospetto 5.3b'!$Q$10","v":0}]
["5510700","$Q$11","Prospetto 5.3b",false,"prospetto 5.3b'!$Q$11",{"$f":"'prospetto 5.3b'!$Q$11","v":0}]
["5510800","$Q$12","Prospetto 5.3b",false,"prospetto 5.3b'!$Q$12",{"$f":"'prospetto 5.3b'!$Q$12","v":0}]
["5510900","$Q$13","Prospetto 5.3b",false,"prospetto 5.3b'!$Q$13",{"$f":"'prospetto 5.3b'!$Q$13","v":0}]
["5511000","$Q$14","Prospetto 5.3b",false,"prospetto 5.3b'!$Q$14",{"$f":"'prospetto 5.3b'!$Q$14","v":0}]
["5511100","$Q$15","Prospetto 5.3b",false,"prospetto 5.3b'!$Q$15",{"$f":"'prospetto 5.3b'!$Q$15","v":0}]
["5511200","$Q$16","Prospetto 5.3b",false,"prospetto 5.3b'!$Q$16",{"$f":"'prospetto 5.3b'!$Q$16","v":0}]
["5511300","$Q$17","Prospetto 5.3b",false,"prospetto 5.3b'!$Q$17",{"$f":"'prospetto 5.3b'!$Q$17","v":0}]
["5511400","$Q$18","Prospetto 5.3b",false,"prospetto 5.3b'!$Q$18",{"$f":"'prospetto 5.3b'!$Q$18","v":0}]
["5511500","$Q$19","Prospetto 5.3b",false,"prospetto 5.3b'!$Q$19",{"$f":"'prospetto 5.3b'!$Q$19","v":0}]
["5511600","$Q$20","Prospetto 5.3b",false,"prospetto 5.3b'!$Q$20",{"$f":"'prospetto 5.3b'!$Q$20","v":0}]
["5511700","$Q$21","Prospetto 5.3b",false,"prospetto 5.3b'!$Q$21",{"$f":"'prospetto 5.3b'!$Q$21","v":0}]
["5511800","$Q$22","Prospetto 5.3b",true,"prospetto 5.3b'!$Q$22",{"$f":"'prospetto 5.3b'!$Q$22","v":0}]
["5511900","$Q$23","Prospetto 5.3b",false,"prospetto 5.3b'!$Q$23",{"$f":"'prospetto 5.3b'!$Q$23","v":0}]
["5512000","$Q$24","Prospetto 5.3b",true,"prospetto 5.3b'!$Q$24",{"$f":"'prospetto 5.3b'!$Q$24","v":0}]
["5512100","$S$10","Prospetto 5.3b",false,"prospetto 5.3b'!$S$10",{"$f":"'prospetto 5.3b'!$S$10","v":0}]
["5512200","$S$11","Prospetto 5.3b",false,"prospetto 5.3b'!$S$11",{"$f":"'prospetto 5.3b'!$S$11","v":0}]
["5512300","$S$12","Prospetto 5.3b",false,"prospetto 5.3b'!$S$12",{"$f":"'prospetto 5.3b'!$S$12","v":0}]
["5512400","$S$13","Prospetto 5.3b",false,"prospetto 5.3b'!$S$13",{"$f":"'prospetto 5.3b'!$S$13","v":0}]
["5512500","$S$14","Prospetto 5.3b",false,"prospetto 5.3b'!$S$14",{"$f":"'prospetto 5.3b'!$S$14","v":0}]
["5512600","$S$15","Prospetto 5.3b",false,"prospetto 5.3b'!$S$15",{"$f":"'prospetto 5.3b'!$S$15","v":0}]
["5512700","$S$16","Prospetto 5.3b",false,"prospetto 5.3b'!$S$16",{"$f":"'prospetto 5.3b'!$S$16","v":0}]
["5512800","$S$17","Prospetto 5.3b",false,"prospetto 5.3b'!$S$17",{"$f":"'prospetto 5.3b'!$S$17","v":0}]
["5512900","$S$18","Prospetto 5.3b",false,"prospetto 5.3b'!$S$18",{"$f":"'prospetto 5.3b'!$S$18","v":0}]
["5513000","$S$19","Prospetto 5.3b",false,"prospetto 5.3b'!$S$19",{"$f":"'prospetto 5.3b'!$S$19","v":0}]
["5513100","$S$20","Prospetto 5.3b",false,"prospetto 5.3b'!$S$20",{"$f":"'prospetto 5.3b'!$S$20","v":0}]
["5513200","$S$21","Prospetto 5.3b",false,"prospetto 5.3b'!$S$21",{"$f":"'prospetto 5.3b'!$S$21","v":0}]
["5513300","$S$22","Prospetto 5.3b",true,"prospetto 5.3b'!$S$22",{"$f":"'prospetto 5.3b'!$S$22","v":0}]
["5513400","$S$23","Prospetto 5.3b",false,"prospetto 5.3b'!$S$23",{"$f":"'prospetto 5.3b'!$S$23","v":0}]
["5513500","$S$24","Prospetto 5.3b",true,"prospetto 5.3b'!$S$24",{"$f":"'prospetto 5.3b'!$S$24","v":0}]
["5513600","$U$10","Prospetto 5.3b",false,"prospetto 5.3b'!$U$10",{"$f":"'prospetto 5.3b'!$U$10","v":0}]
["5513700","$U$11","Prospetto 5.3b",false,"prospetto 5.3b'!$U$11",{"$f":"'prospetto 5.3b'!$U$11","v":0}]
["5513800","$U$12","Prospetto 5.3b",false,"prospetto 5.3b'!$U$12",{"$f":"'prospetto 5.3b'!$U$12","v":0}]
["5513900","$U$13","Prospetto 5.3b",false,"prospetto 5.3b'!$U$13",{"$f":"'prospetto 5.3b'!$U$13","v":0}]
["5514000","$U$14","Prospetto 5.3b",false,"prospetto 5.3b'!$U$14",{"$f":"'prospetto 5.3b'!$U$14","v":0}]
["5514100","$U$15","Prospetto 5.3b",false,"prospetto 5.3b'!$U$15",{"$f":"'prospetto 5.3b'!$U$15","v":0}]
["5514200","$U$16","Prospetto 5.3b",false,"prospetto 5.3b'!$U$16",{"$f":"'prospetto 5.3b'!$U$16","v":0}]
["5514300","$U$17","Prospetto 5.3b",false,"prospetto 5.3b'!$U$17",{"$f":"'prospetto 5.3b'!$U$17","v":0}]
["5514400","$U$18","Prospetto 5.3b",false,"prospetto 5.3b'!$U$18",{"$f":"'prospetto 5.3b'!$U$18","v":0}]
["5514500","$U$19","Prospetto 5.3b",false,"prospetto 5.3b'!$U$19",{"$f":"'prospetto 5.3b'!$U$19","v":0}]
["5514600","$U$20","Prospetto 5.3b",false,"prospetto 5.3b'!$U$20",{"$f":"'prospetto 5.3b'!$U$20","v":0}]
["5514700","$U$21","Prospetto 5.3b",false,"prospetto 5.3b'!$U$21",{"$f":"'prospetto 5.3b'!$U$21","v":0}]
["5514800","$U$22","Prospetto 5.3b",true,"prospetto 5.3b'!$U$22",{"$f":"'prospetto 5.3b'!$U$22","v":0}]
["5514900","$U$23","Prospetto 5.3b",false,"prospetto 5.3b'!$U$23",{"$f":"'prospetto 5.3b'!$U$23","v":0}]
["5515000","$U$24","Prospetto 5.3b",true,"prospetto 5.3b'!$U$24",{"$f":"'prospetto 5.3b'!$U$24","v":0}]
["5515100","$W$10","Prospetto 5.3b",false,"prospetto 5.3b'!$W$10",{"$f":"'prospetto 5.3b'!$W$10","v":0}]
["5515200","$W$11","Prospetto 5.3b",false,"prospetto 5.3b'!$W$11",{"$f":"'prospetto 5.3b'!$W$11","v":0}]
["5515300","$W$12","Prospetto 5.3b",false,"prospetto 5.3b'!$W$12",{"$f":"'prospetto 5.3b'!$W$12","v":0}]
["5515400","$W$13","Prospetto 5.3b",false,"prospetto 5.3b'!$W$13",{"$f":"'prospetto 5.3b'!$W$13","v":0}]
["5515500","$W$14","Prospetto 5.3b",false,"prospetto 5.3b'!$W$14",{"$f":"'prospetto 5.3b'!$W$14","v":0}]
["5515600","$W$15","Prospetto 5.3b",false,"prospetto 5.3b'!$W$15",{"$f":"'prospetto 5.3b'!$W$15","v":0}]
["5515700","$W$16","Prospetto 5.3b",false,"prospetto 5.3b'!$W$16",{"$f":"'prospetto 5.3b'!$W$16","v":0}]
["5515800","$W$17","Prospetto 5.3b",false,"prospetto 5.3b'!$W$17",{"$f":"'prospetto 5.3b'!$W$17","v":0}]
["5515900","$W$18","Prospetto 5.3b",false,"prospetto 5.3b'!$W$18",{"$f":"'prospetto 5.3b'!$W$18","v":0}]
["5516000","$W$19","Prospetto 5.3b",false,"prospetto 5.3b'!$W$19",{"$f":"'prospetto 5.3b'!$W$19","v":0}]
["5516100","$W$20","Prospetto 5.3b",false,"prospetto 5.3b'!$W$20",{"$f":"'prospetto 5.3b'!$W$20","v":0}]
["5516200","$W$21","Prospetto 5.3b",false,"prospetto 5.3b'!$W$21",{"$f":"'prospetto 5.3b'!$W$21","v":0}]
["5516300","$W$22","Prospetto 5.3b",true,"prospetto 5.3b'!$W$22",{"$f":"'prospetto 5.3b'!$W$22","v":0}]
["5516400","$W$23","Prospetto 5.3b",false,"prospetto 5.3b'!$W$23",{"$f":"'prospetto 5.3b'!$W$23","v":0}]
["5516500","$W$24","Prospetto 5.3b",true,"prospetto 5.3b'!$W$24",{"$f":"'prospetto 5.3b'!$W$24","v":0}]
["5516600","$Y$10","Prospetto 5.3b",false,"prospetto 5.3b'!$Y$10",{"$f":"'prospetto 5.3b'!$Y$10","v":0}]
["5516700","$Y$11","Prospetto 5.3b",false,"prospetto 5.3b'!$Y$11",{"$f":"'prospetto 5.3b'!$Y$11","v":0}]
["5516800","$Y$12","Prospetto 5.3b",false,"prospetto 5.3b'!$Y$12",{"$f":"'prospetto 5.3b'!$Y$12","v":0}]
["5516900","$Y$13","Prospetto 5.3b",false,"prospetto 5.3b'!$Y$13",{"$f":"'prospetto 5.3b'!$Y$13","v":0}]
["5517000","$Y$14","Prospetto 5.3b",false,"prospetto 5.3b'!$Y$14",{"$f":"'prospetto 5.3b'!$Y$14","v":0}]
["5517100","$Y$15","Prospetto 5.3b",false,"prospetto 5.3b'!$Y$15",{"$f":"'prospetto 5.3b'!$Y$15","v":0}]
["5517200","$Y$16","Prospetto 5.3b",false,"prospetto 5.3b'!$Y$16",{"$f":"'prospetto 5.3b'!$Y$16","v":0}]
["5517300","$Y$17","Prospetto 5.3b",false,"prospetto 5.3b'!$Y$17",{"$f":"'prospetto 5.3b'!$Y$17","v":0}]
["5517400","$Y$18","Prospetto 5.3b",false,"prospetto 5.3b'!$Y$18",{"$f":"'prospetto 5.3b'!$Y$18","v":0}]
["5517500","$Y$19","Prospetto 5.3b",false,"prospetto 5.3b'!$Y$19",{"$f":"'prospetto 5.3b'!$Y$19","v":0}]
["5517600","$Y$20","Prospetto 5.3b",false,"prospetto 5.3b'!$Y$20",{"$f":"'prospetto 5.3b'!$Y$20","v":0}]
["5517700","$Y$21","Prospetto 5.3b",false,"prospetto 5.3b'!$Y$21",{"$f":"'prospetto 5.3b'!$Y$21","v":0}]
["5517800","$Y$22","Prospetto 5.3b",true,"prospetto 5.3b'!$Y$22",{"$f":"'prospetto 5.3b'!$Y$22","v":0}]
["5517900","$Y$23","Prospetto 5.3b",false,"prospetto 5.3b'!$Y$23",{"$f":"'prospetto 5.3b'!$Y$23","v":0}]
["5518000","$Y$24","Prospetto 5.3b",true,"prospetto 5.3b'!$Y$24",{"$f":"'prospetto 5.3b'!$Y$24","v":0}]
["5518100","$AA$10","Prospetto 5.3b",false,"prospetto 5.3b'!$AA$10",{"$f":"'prospetto 5.3b'!$AA$10","v":0}]
["5518200","$AA$11","Prospetto 5.3b",false,"prospetto 5.3b'!$AA$11",{"$f":"'prospetto 5.3b'!$AA$11","v":0}]
["5518300","$AA$12","Prospetto 5.3b",false,"prospetto 5.3b'!$AA$12",{"$f":"'prospetto 5.3b'!$AA$12","v":0}]
["5518400","$AA$13","Prospetto 5.3b",false,"prospetto 5.3b'!$AA$13",{"$f":"'prospetto 5.3b'!$AA$13","v":0}]
["5518500","$AA$14","Prospetto 5.3b",false,"prospetto 5.3b'!$AA$14",{"$f":"'prospetto 5.3b'!$AA$14","v":0}]
["5518600","$AA$15","Prospetto 5.3b",false,"prospetto 5.3b'!$AA$15",{"$f":"'prospetto 5.3b'!$AA$15","v":0}]
["5518700","$AA$16","Prospetto 5.3b",false,"prospetto 5.3b'!$AA$16",{"$f":"'prospetto 5.3b'!$AA$16","v":0}]
["5518800","$AA$17","Prospetto 5.3b",false,"prospetto 5.3b'!$AA$17",{"$f":"'prospetto 5.3b'!$AA$17","v":0}]
["5518900","$AA$18","Prospetto 5.3b",false,"prospetto 5.3b'!$AA$18",{"$f":"'prospetto 5.3b'!$AA$18","v":0}]
["5519000","$AA$19","Prospetto 5.3b",false,"prospetto 5.3b'!$AA$19",{"$f":"'prospetto 5.3b'!$AA$19","v":0}]
["5519100","$AA$20","Prospetto 5.3b",false,"prospetto 5.3b'!$AA$20",{"$f":"'prospetto 5.3b'!$AA$20","v":0}]
["5519200","$AA$21","Prospetto 5.3b",false,"prospetto 5.3b'!$AA$21",{"$f":"'prospetto 5.3b'!$AA$21","v":0}]
["5519300","$AA$22","Prospetto 5.3b",true,"prospetto 5.3b'!$AA$22",{"$f":"'prospetto 5.3b'!$AA$22","v":0}]
["5519400","$AA$23","Prospetto 5.3b",false,"prospetto 5.3b'!$AA$23",{"$f":"'prospetto 5.3b'!$AA$23","v":0}]
["5519500","$AA$24","Prospetto 5.3b",true,"prospetto 5.3b'!$AA$24",{"$f":"'prospetto 5.3b'!$AA$24","v":0}]
["5519600","$AC$10","Prospetto 5.3b",false,"prospetto 5.3b'!$AC$10",{"$f":"'prospetto 5.3b'!$AC$10","v":0}]
["5519700","$AC$11","Prospetto 5.3b",false,"prospetto 5.3b'!$AC$11",{"$f":"'prospetto 5.3b'!$AC$11","v":0}]
["5519800","$AC$12","Prospetto 5.3b",false,"prospetto 5.3b'!$AC$12",{"$f":"'prospetto 5.3b'!$AC$12","v":0}]
["5519900","$AC$13","Prospetto 5.3b",false,"prospetto 5.3b'!$AC$13",{"$f":"'prospetto 5.3b'!$AC$13","v":0}]
["5520000","$AC$14","Prospetto 5.3b",false,"prospetto 5.3b'!$AC$14",{"$f":"'prospetto 5.3b'!$AC$14","v":0}]
["5520100","$AC$15","Prospetto 5.3b",false,"prospetto 5.3b'!$AC$15",{"$f":"'prospetto 5.3b'!$AC$15","v":0}]
["5520200","$AC$16","Prospetto 5.3b",false,"prospetto 5.3b'!$AC$16",{"$f":"'prospetto 5.3b'!$AC$16","v":0}]
["5520300","$AC$17","Prospetto 5.3b",false,"prospetto 5.3b'!$AC$17",{"$f":"'prospetto 5.3b'!$AC$17","v":0}]
["5520400","$AC$18","Prospetto 5.3b",false,"prospetto 5.3b'!$AC$18",{"$f":"'prospetto 5.3b'!$AC$18","v":0}]
["5520500","$AC$19","Prospetto 5.3b",false,"prospetto 5.3b'!$AC$19",{"$f":"'prospetto 5.3b'!$AC$19","v":0}]
["5520600","$AC$20","Prospetto 5.3b",false,"prospetto 5.3b'!$AC$20",{"$f":"'prospetto 5.3b'!$AC$20","v":0}]
["5520700","$AC$21","Prospetto 5.3b",false,"prospetto 5.3b'!$AC$21",{"$f":"'prospetto 5.3b'!$AC$21","v":0}]
["5520800","$AC$22","Prospetto 5.3b",true,"prospetto 5.3b'!$AC$22",{"$f":"'prospetto 5.3b'!$AC$22","v":0}]
["5520900","$AC$23","Prospetto 5.3b",false,"prospetto 5.3b'!$AC$23",{"$f":"'prospetto 5.3b'!$AC$23","v":0}]
["5521000","$AC$24","Prospetto 5.3b",true,"prospetto 5.3b'!$AC$24",{"$f":"'prospetto 5.3b'!$AC$24","v":0}]
["5521100","$AE$10","Prospetto 5.3b",false,"prospetto 5.3b'!$AE$10",{"$f":"'prospetto 5.3b'!$AE$10","v":0}]
["5521200","$AE$11","Prospetto 5.3b",false,"prospetto 5.3b'!$AE$11",{"$f":"'prospetto 5.3b'!$AE$11","v":0}]
["5521300","$AE$12","Prospetto 5.3b",false,"prospetto 5.3b'!$AE$12",{"$f":"'prospetto 5.3b'!$AE$12","v":0}]
["5521400","$AE$13","Prospetto 5.3b",false,"prospetto 5.3b'!$AE$13",{"$f":"'prospetto 5.3b'!$AE$13","v":0}]
["5521500","$AE$14","Prospetto 5.3b",false,"prospetto 5.3b'!$AE$14",{"$f":"'prospetto 5.3b'!$AE$14","v":0}]
["5521600","$AE$15","Prospetto 5.3b",false,"prospetto 5.3b'!$AE$15",{"$f":"'prospetto 5.3b'!$AE$15","v":0}]
["5521700","$AE$16","Prospetto 5.3b",false,"prospetto 5.3b'!$AE$16",{"$f":"'prospetto 5.3b'!$AE$16","v":0}]
["5521800","$AE$17","Prospetto 5.3b",false,"prospetto 5.3b'!$AE$17",{"$f":"'prospetto 5.3b'!$AE$17","v":0}]
["5521900","$AE$18","Prospetto 5.3b",false,"prospetto 5.3b'!$AE$18",{"$f":"'prospetto 5.3b'!$AE$18","v":0}]
["5522000","$AE$19","Prospetto 5.3b",false,"prospetto 5.3b'!$AE$19",{"$f":"'prospetto 5.3b'!$AE$19","v":0}]
["5522100","$AE$20","Prospetto 5.3b",false,"prospetto 5.3b'!$AE$20",{"$f":"'prospetto 5.3b'!$AE$20","v":0}]
["5522200","$AE$21","Prospetto 5.3b",false,"prospetto 5.3b'!$AE$21",{"$f":"'prospetto 5.3b'!$AE$21","v":0}]
["5522300","$AE$22","Prospetto 5.3b",true,"prospetto 5.3b'!$AE$22",{"$f":"'prospetto 5.3b'!$AE$22","v":0}]
["5522400","$AE$23","Prospetto 5.3b",false,"prospetto 5.3b'!$AE$23",{"$f":"'prospetto 5.3b'!$AE$23","v":0}]
["5522500","$AE$24","Prospetto 5.3b",true,"prospetto 5.3b'!$AE$24",{"$f":"'prospetto 5.3b'!$AE$24","v":0}]
["5400100","$C$10","Prospetto 5.4",false,"prospetto 5.4'!$C$10",{"$f":"'prospetto 5.4'!$C$10","v":0}]
["5400200","$C$11","Prospetto 5.4",false,"prospetto 5.4'!$C$11",{"$f":"'prospetto 5.4'!$C$11","v":0}]
["5400300","$C$12","Prospetto 5.4",false,"prospetto 5.4'!$C$12",{"$f":"'prospetto 5.4'!$C$12","v":0}]
["5400400","$C$13","Prospetto 5.4",false,"prospetto 5.4'!$C$13",{"$f":"'prospetto 5.4'!$C$13","v":0}]
["5400500","$C$14","Prospetto 5.4",false,"prospetto 5.4'!$C$14",{"$f":"'prospetto 5.4'!$C$14","v":0}]
["5400600","$C$15","Prospetto 5.4",false,"prospetto 5.4'!$C$15",{"$f":"'prospetto 5.4'!$C$15","v":0}]
["5400700","$C$16","Prospetto 5.4",false,"prospetto 5.4'!$C$16",{"$f":"'prospetto 5.4'!$C$16","v":0}]
["5400800","$C$17","Prospetto 5.4",false,"prospetto 5.4'!$C$17",{"$f":"'prospetto 5.4'!$C$17","v":0}]
["5400900","$C$18","Prospetto 5.4",false,"prospetto 5.4'!$C$18",{"$f":"'prospetto 5.4'!$C$18","v":0}]
["5401000","$C$19","Prospetto 5.4",false,"prospetto 5.4'!$C$19",{"$f":"'prospetto 5.4'!$C$19","v":0}]
["5401100","$C$20","Prospetto 5.4",false,"prospetto 5.4'!$C$20",{"$f":"'prospetto 5.4'!$C$20","v":0}]
["5401200","$C$21","Prospetto 5.4",false,"prospetto 5.4'!$C$21",{"$f":"'prospetto 5.4'!$C$21","v":0}]
["5401300","$C$22","Prospetto 5.4",true,"prospetto 5.4'!$C$22",{"$f":"'prospetto 5.4'!$C$22","v":0}]
["5401400","$C$23","Prospetto 5.4",false,"prospetto 5.4'!$C$23",{"$f":"'prospetto 5.4'!$C$23","v":0}]
["5401500","$C$24","Prospetto 5.4",true,"prospetto 5.4'!$C$24",{"$f":"'prospetto 5.4'!$C$24","v":0}]
["5401600","$E$10","Prospetto 5.4",false,"prospetto 5.4'!$E$10",{"$f":"'prospetto 5.4'!$E$10","v":0}]
["5401700","$E$11","Prospetto 5.4",false,"prospetto 5.4'!$E$11",{"$f":"'prospetto 5.4'!$E$11","v":0}]
["5401800","$E$12","Prospetto 5.4",false,"prospetto 5.4'!$E$12",{"$f":"'prospetto 5.4'!$E$12","v":0}]
["5401900","$E$13","Prospetto 5.4",false,"prospetto 5.4'!$E$13",{"$f":"'prospetto 5.4'!$E$13","v":0}]
["5402000","$E$14","Prospetto 5.4",false,"prospetto 5.4'!$E$14",{"$f":"'prospetto 5.4'!$E$14","v":0}]
["5402100","$E$15","Prospetto 5.4",false,"prospetto 5.4'!$E$15",{"$f":"'prospetto 5.4'!$E$15","v":0}]
["5402200","$E$16","Prospetto 5.4",false,"prospetto 5.4'!$E$16",{"$f":"'prospetto 5.4'!$E$16","v":0}]
["5402300","$E$17","Prospetto 5.4",false,"prospetto 5.4'!$E$17",{"$f":"'prospetto 5.4'!$E$17","v":0}]
["5402400","$E$18","Prospetto 5.4",false,"prospetto 5.4'!$E$18",{"$f":"'prospetto 5.4'!$E$18","v":0}]
["5402500","$E$19","Prospetto 5.4",false,"prospetto 5.4'!$E$19",{"$f":"'prospetto 5.4'!$E$19","v":0}]
["5402600","$E$20","Prospetto 5.4",false,"prospetto 5.4'!$E$20",{"$f":"'prospetto 5.4'!$E$20","v":0}]
["5402700","$E$21","Prospetto 5.4",false,"prospetto 5.4'!$E$21",{"$f":"'prospetto 5.4'!$E$21","v":0}]
["5402800","$E$22","Prospetto 5.4",true,"prospetto 5.4'!$E$22",{"$f":"'prospetto 5.4'!$E$22","v":0}]
["5402900","$E$23","Prospetto 5.4",false,"prospetto 5.4'!$E$23",{"$f":"'prospetto 5.4'!$E$23","v":0}]
["5403000","$E$24","Prospetto 5.4",true,"prospetto 5.4'!$E$24",{"$f":"'prospetto 5.4'!$E$24","v":0}]
["5403100","$G$10","Prospetto 5.4",false,"prospetto 5.4'!$G$10",{"$f":"'prospetto 5.4'!$G$10","v":0}]
["5403200","$G$11","Prospetto 5.4",false,"prospetto 5.4'!$G$11",{"$f":"'prospetto 5.4'!$G$11","v":0}]
["5403300","$G$12","Prospetto 5.4",false,"prospetto 5.4'!$G$12",{"$f":"'prospetto 5.4'!$G$12","v":0}]
["5403400","$G$13","Prospetto 5.4",false,"prospetto 5.4'!$G$13",{"$f":"'prospetto 5.4'!$G$13","v":0}]
["5403500","$G$14","Prospetto 5.4",false,"prospetto 5.4'!$G$14",{"$f":"'prospetto 5.4'!$G$14","v":0}]
["5403600","$G$15","Prospetto 5.4",false,"prospetto 5.4'!$G$15",{"$f":"'prospetto 5.4'!$G$15","v":0}]
["5403700","$G$16","Prospetto 5.4",false,"prospetto 5.4'!$G$16",{"$f":"'prospetto 5.4'!$G$16","v":0}]
["5403800","$G$17","Prospetto 5.4",false,"prospetto 5.4'!$G$17",{"$f":"'prospetto 5.4'!$G$17","v":0}]
["5403900","$G$18","Prospetto 5.4",false,"prospetto 5.4'!$G$18",{"$f":"'prospetto 5.4'!$G$18","v":0}]
["5404000","$G$19","Prospetto 5.4",false,"prospetto 5.4'!$G$19",{"$f":"'prospetto 5.4'!$G$19","v":0}]
["5404100","$G$20","Prospetto 5.4",false,"prospetto 5.4'!$G$20",{"$f":"'prospetto 5.4'!$G$20","v":0}]
["5404200","$G$21","Prospetto 5.4",false,"prospetto 5.4'!$G$21",{"$f":"'prospetto 5.4'!$G$21","v":0}]
["5404300","$G$22","Prospetto 5.4",true,"prospetto 5.4'!$G$22",{"$f":"'prospetto 5.4'!$G$22","v":0}]
["5404400","$G$23","Prospetto 5.4",false,"prospetto 5.4'!$G$23",{"$f":"'prospetto 5.4'!$G$23","v":0}]
["5404500","$G$24","Prospetto 5.4",true,"prospetto 5.4'!$G$24",{"$f":"'prospetto 5.4'!$G$24","v":0}]
["6000100","$G$10","Prospetto 6",false,"prospetto 6'!$G$10",{"$f":"'prospetto 6'!$G$10","v":0}]
["6000200","$G$11","Prospetto 6",false,"prospetto 6'!$G$11",{"$f":"'prospetto 6'!$G$11","v":0}]
["6000300","$G$12","Prospetto 6",false,"prospetto 6'!$G$12",{"$f":"'prospetto 6'!$G$12","v":0}]
["6000400","$G$13","Prospetto 6",false,"prospetto 6'!$G$13",{"$f":"'prospetto 6'!$G$13","v":0}]
["6000500","$G$14","Prospetto 6",false,"prospetto 6'!$G$14",{"$f":"'prospetto 6'!$G$14","v":0}]
["6000600","$G$15","Prospetto 6",false,"prospetto 6'!$G$15",{"$f":"'prospetto 6'!$G$15","v":0}]
["6000700","$G$16","Prospetto 6",true,"prospetto 6'!$G$16",{"$f":"'prospetto 6'!$G$16","v":0}]
["6001100","$I$10","Prospetto 6",false,"prospetto 6'!$I$10",{"$f":"'prospetto 6'!$I$10","v":0}]
["6001200","$I$11","Prospetto 6",false,"prospetto 6'!$I$11",{"$f":"'prospetto 6'!$I$11","v":0}]
["6001300","$I$12","Prospetto 6",false,"prospetto 6'!$I$12",{"$f":"'prospetto 6'!$I$12","v":0}]
["6001400","$I$13","Prospetto 6",false,"prospetto 6'!$I$13",{"$f":"'prospetto 6'!$I$13","v":0}]
["6001500","$I$14","Prospetto 6",false,"prospetto 6'!$I$14",{"$f":"'prospetto 6'!$I$14","v":0}]
["6001600","$I$15","Prospetto 6",false,"prospetto 6'!$I$15",{"$f":"'prospetto 6'!$I$15","v":0}]
["6001700","$I$16","Prospetto 6",true,"prospetto 6'!$I$16",{"$f":"'prospetto 6'!$I$16","v":0}]
["6002100","$K$10","Prospetto 6",false,"prospetto 6'!$K$10",{"$f":"'prospetto 6'!$K$10","v":0}]
["6002200","$K$11","Prospetto 6",false,"prospetto 6'!$K$11",{"$f":"'prospetto 6'!$K$11","v":0}]
["6002300","$K$12","Prospetto 6",false,"prospetto 6'!$K$12",{"$f":"'prospetto 6'!$K$12","v":0}]
["6002400","$K$13","Prospetto 6",false,"prospetto 6'!$K$13",{"$f":"'prospetto 6'!$K$13","v":0}]
["6002500","$K$14","Prospetto 6",false,"prospetto 6'!$K$14",{"$f":"'prospetto 6'!$K$14","v":0}]
["6002600","$K$15","Prospetto 6",false,"prospetto 6'!$K$15",{"$f":"'prospetto 6'!$K$15","v":0}]
["6002700","$K$16","Prospetto 6",true,"prospetto 6'!$K$16",{"$f":"'prospetto 6'!$K$16","v":0}]
["6003100","$M$10","Prospetto 6",true,"prospetto 6'!$M$10",{"$f":"'prospetto 6'!$M$10","v":0}]
["6003200","$M$11","Prospetto 6",true,"prospetto 6'!$M$11",{"$f":"'prospetto 6'!$M$11","v":0}]
["6003300","$M$12","Prospetto 6",true,"prospetto 6'!$M$12",{"$f":"'prospetto 6'!$M$12","v":0}]
["6003400","$M$13","Prospetto 6",true,"prospetto 6'!$M$13",{"$f":"'prospetto 6'!$M$13","v":0}]
["6003500","$M$14","Prospetto 6",true,"prospetto 6'!$M$14",{"$f":"'prospetto 6'!$M$14","v":0}]
["6003600","$M$15","Prospetto 6",true,"prospetto 6'!$M$15",{"$f":"'prospetto 6'!$M$15","v":0}]
["6003700","$M$16","Prospetto 6",true,"prospetto 6'!$M$16",{"$f":"'prospetto 6'!$M$16","v":0}]
["6004100","$O$10","Prospetto 6",false,"prospetto 6'!$O$10",{"$f":"'prospetto 6'!$O$10","v":0}]
["6004200","$O$11","Prospetto 6",false,"prospetto 6'!$O$11",{"$f":"'prospetto 6'!$O$11","v":0}]
["6004300","$O$12","Prospetto 6",false,"prospetto 6'!$O$12",{"$f":"'prospetto 6'!$O$12","v":0}]
["6004400","$O$13","Prospetto 6",false,"prospetto 6'!$O$13",{"$f":"'prospetto 6'!$O$13","v":0}]
["6004500","$O$14","Prospetto 6",false,"prospetto 6'!$O$14",{"$f":"'prospetto 6'!$O$14","v":0}]
["6004600","$O$15","Prospetto 6",false,"prospetto 6'!$O$15",{"$f":"'prospetto 6'!$O$15","v":0}]
["6004700","$O$16","Prospetto 6",true,"prospetto 6'!$O$16",{"$f":"'prospetto 6'!$O$16","v":0}]
["6005100","$Q$10","Prospetto 6",false,"prospetto 6'!$Q$10",{"$f":"'prospetto 6'!$Q$10","v":0}]
["6005200","$Q$11","Prospetto 6",false,"prospetto 6'!$Q$11",{"$f":"'prospetto 6'!$Q$11","v":0}]
["6005300","$Q$12","Prospetto 6",false,"prospetto 6'!$Q$12",{"$f":"'prospetto 6'!$Q$12","v":0}]
["6005400","$Q$13","Prospetto 6",false,"prospetto 6'!$Q$13",{"$f":"'prospetto 6'!$Q$13","v":0}]
["6005500","$Q$14","Prospetto 6",false,"prospetto 6'!$Q$14",{"$f":"'prospetto 6'!$Q$14","v":0}]
["6005600","$Q$15","Prospetto 6",false,"prospetto 6'!$Q$15",{"$f":"'prospetto 6'!$Q$15","v":0}]
["6005700","$Q$16","Prospetto 6",true,"prospetto 6'!$Q$16",{"$f":"'prospetto 6'!$Q$16","v":0}]
["6006100","$S$10","Prospetto 6",false,"prospetto 6'!$S$10",{"$f":"'prospetto 6'!$S$10","v":0}]
["6006200","$S$11","Prospetto 6",false,"prospetto 6'!$S$11",{"$f":"'prospetto 6'!$S$11","v":0}]
["6006300","$S$12","Prospetto 6",false,"prospetto 6'!$S$12",{"$f":"'prospetto 6'!$S$12","v":0}]
["6006400","$S$13","Prospetto 6",false,"prospetto 6'!$S$13",{"$f":"'prospetto 6'!$S$13","v":0}]
["6006500","$S$14","Prospetto 6",false,"prospetto 6'!$S$14",{"$f":"'prospetto 6'!$S$14","v":0}]
["6006600","$S$15","Prospetto 6",false,"prospetto 6'!$S$15",{"$f":"'prospetto 6'!$S$15","v":0}]
["6006700","$S$16","Prospetto 6",true,"prospetto 6'!$S$16",{"$f":"'prospetto 6'!$S$16","v":0}]
["7100100","$F$9","Prospetto 7.1",false,"prospetto 7.1'!$F$9",{"$f":"'prospetto 7.1'!$F$9","v":0}]
["7100200","$F$10","Prospetto 7.1",true,"prospetto 7.1'!$F$10",{"$f":"'prospetto 7.1'!$F$10","v":0}]
["7100300","$F$11","Prospetto 7.1",false,"prospetto 7.1'!$F$11",{"$f":"'prospetto 7.1'!$F$11","v":0}]
["7100400","$F$12","Prospetto 7.1",false,"prospetto 7.1'!$F$12",{"$f":"'prospetto 7.1'!$F$12","v":0}]
["7112100","$F$13","Prospetto 7.1",false,"prospetto 7.1'!$F$13",{"$f":"'prospetto 7.1'!$F$13","v":0}]
["7112600","$F$14","Prospetto 7.1",false,"prospetto 7.1'!$F$14",{"$f":"'prospetto 7.1'!$F$14","v":0}]
["7112700","$F$15","Prospetto 7.1",false,"prospetto 7.1'!$F$15",{"$f":"'prospetto 7.1'!$F$15","v":0}]
["7112800","$F$16","Prospetto 7.1",false,"prospetto 7.1'!$F$16",{"$f":"'prospetto 7.1'!$F$16","v":0}]
["7112900","$F$17","Prospetto 7.1",false,"prospetto 7.1'!$F$17",{"$f":"'prospetto 7.1'!$F$17","v":0}]
["7100500","$F$18","Prospetto 7.1",false,"prospetto 7.1'!$F$18",{"$f":"'prospetto 7.1'!$F$18","v":0}]
["7113000","$F$19","Prospetto 7.1",false,"prospetto 7.1'!$F$19",{"$f":"'prospetto 7.1'!$F$19","v":0}]
["7113100","$F$20","Prospetto 7.1",true,"prospetto 7.1'!$F$20",{"$f":"'prospetto 7.1'!$F$20","v":0}]
["7113200","$F$21","Prospetto 7.1",false,"prospetto 7.1'!$F$21",{"$f":"'prospetto 7.1'!$F$21","v":0}]
["7113300","$F$22","Prospetto 7.1",false,"prospetto 7.1'!$F$22",{"$f":"'prospetto 7.1'!$F$22","v":0}]
["7113400","$F$23","Prospetto 7.1",false,"prospetto 7.1'!$F$23",{"$f":"'prospetto 7.1'!$F$23","v":0}]
["7113500","$F$24","Prospetto 7.1",false,"prospetto 7.1'!$F$24",{"$f":"'prospetto 7.1'!$F$24","v":0}]
["7110800","$F$25","Prospetto 7.1",false,"prospetto 7.1'!$F$25",{"$f":"'prospetto 7.1'!$F$25","v":0}]
["7110900","$F$26","Prospetto 7.1",false,"prospetto 7.1'!$F$26",{"$f":"'prospetto 7.1'!$F$26","v":0}]
["7113600","$F$27","Prospetto 7.1",false,"prospetto 7.1'!$F$27",{"$f":"'prospetto 7.1'!$F$27","v":0}]
["7113700","$F$28","Prospetto 7.1",true,"prospetto 7.1'!$F$28",{"$f":"'prospetto 7.1'!$F$28","v":0}]
["7113800","$F$29","Prospetto 7.1",false,"prospetto 7.1'!$F$29",{"$f":"'prospetto 7.1'!$F$29","v":0}]
["7113900","$F$30","Prospetto 7.1",false,"prospetto 7.1'!$F$30",{"$f":"'prospetto 7.1'!$F$30","v":0}]
["7114000","$F$31","Prospetto 7.1",false,"prospetto 7.1'!$F$31",{"$f":"'prospetto 7.1'!$F$31","v":0}]
["7114100","$F$32","Prospetto 7.1",false,"prospetto 7.1'!$F$32",{"$f":"'prospetto 7.1'!$F$32","v":0}]
["7100600","$F$33","Prospetto 7.1",false,"prospetto 7.1'!$F$33",{"$f":"'prospetto 7.1'!$F$33","v":0}]
["7100700","$F$34","Prospetto 7.1",false,"prospetto 7.1'!$F$34",{"$f":"'prospetto 7.1'!$F$34","v":0}]
["7100800","$F$35","Prospetto 7.1",false,"prospetto 7.1'!$F$35",{"$f":"'prospetto 7.1'!$F$35","v":0}]
["7110100","$F$36","Prospetto 7.1",false,"prospetto 7.1'!$F$36",{"$f":"'prospetto 7.1'!$F$36","v":0}]
["7110200","$F$37","Prospetto 7.1",false,"prospetto 7.1'!$F$37",{"$f":"'prospetto 7.1'!$F$37","v":0}]
["7110300","$F$38","Prospetto 7.1",false,"prospetto 7.1'!$F$38",{"$f":"'prospetto 7.1'!$F$38","v":0}]
["7110400","$F$39","Prospetto 7.1",false,"prospetto 7.1'!$F$39",{"$f":"'prospetto 7.1'!$F$39","v":0}]
["7110500","$F$40","Prospetto 7.1",false,"prospetto 7.1'!$F$40",{"$f":"'prospetto 7.1'!$F$40","v":0}]
["7101600","$F$41","Prospetto 7.1",false,"prospetto 7.1'!$F$41",{"$f":"'prospetto 7.1'!$F$41","v":0}]
["7101000","$F$42","Prospetto 7.1",false,"prospetto 7.1'!$F$42",{"$f":"'prospetto 7.1'!$F$42","v":0}]
["7101100","$F$43","Prospetto 7.1",false,"prospetto 7.1'!$F$43",{"$f":"'prospetto 7.1'!$F$43","v":0}]
["7101800","$F$44","Prospetto 7.1",false,"prospetto 7.1'!$F$44",{"$f":"'prospetto 7.1'!$F$44","v":0}]
["7110700","$F$45","Prospetto 7.1",false,"prospetto 7.1'!$F$45",{"$f":"'prospetto 7.1'!$F$45","v":0}]
["7101200","$F$46","Prospetto 7.1",false,"prospetto 7.1'!$F$46",{"$f":"'prospetto 7.1'!$F$46","v":0}]
["7101900","$F$47","Prospetto 7.1",false,"prospetto 7.1'!$F$47",{"$f":"'prospetto 7.1'!$F$47","v":0}]
["7101400","$F$48","Prospetto 7.1",false,"prospetto 7.1'!$F$48",{"$f":"'prospetto 7.1'!$F$48","v":0}]
["7111900","$F$49","Prospetto 7.1",false,"prospetto 7.1'!$F$49",{"$f":"'prospetto 7.1'!$F$49","v":0}]
["7112000","$F$50","Prospetto 7.1",false,"prospetto 7.1'!$F$50",{"$f":"'prospetto 7.1'!$F$50","v":0}]
["7112400","$F$57","Prospetto 7.1",true,"prospetto 7.1'!$F$57",{"$f":"'prospetto 7.1'!$F$57","v":0}]
["7112500","$F$58","Prospetto 7.1",false,"prospetto 7.1'!$F$58",{"$f":"'prospetto 7.1'!$F$58","v":0}]
["7102000","$H$9","Prospetto 7.1",false,"prospetto 7.1'!$H$9",{"$f":"'prospetto 7.1'!$H$9","v":0}]
["7102100","$H$10","Prospetto 7.1",true,"prospetto 7.1'!$H$10",{"$f":"'prospetto 7.1'!$H$10","v":0}]
["7102200","$H$11","Prospetto 7.1",false,"prospetto 7.1'!$H$11",{"$f":"'prospetto 7.1'!$H$11","v":0}]
["7111700","$H$25","Prospetto 7.1",false,"prospetto 7.1'!$H$25",{"$f":"'prospetto 7.1'!$H$25","v":0}]
["7111800","$H$26","Prospetto 7.1",false,"prospetto 7.1'!$H$26",{"$f":"'prospetto 7.1'!$H$26","v":0}]
["7112200","$H$49","Prospetto 7.1",false,"prospetto 7.1'!$H$49",{"$f":"'prospetto 7.1'!$H$49","v":0}]
["7112300","$H$50","Prospetto 7.1",false,"prospetto 7.1'!$H$50",{"$f":"'prospetto 7.1'!$H$50","v":0}]
["7201500","$E$59","Prospetto 7.2",false,"prospetto 7.2'!$E$59",{"$f":"'prospetto 7.2'!$E$59","v":0}]
["7201600","$E$60","Prospetto 7.2",false,"prospetto 7.2'!$E$60",{"$f":"'prospetto 7.2'!$E$60","v":0}]
["7201700","$E$61","Prospetto 7.2",false,"prospetto 7.2'!$E$61",{"$f":"'prospetto 7.2'!$E$61","v":0}]
["7201800","$E$62","Prospetto 7.2",false,"prospetto 7.2'!$E$62",{"$f":"'prospetto 7.2'!$E$62","v":0}]
["7201900","$G$59","Prospetto 7.2",false,"prospetto 7.2'!$G$59",{"$f":"'prospetto 7.2'!$G$59","v":0}]
["7202000","$G$60","Prospetto 7.2",false,"prospetto 7.2'!$G$60",{"$f":"'prospetto 7.2'!$G$60","v":0}]
["7202100","$G$61","Prospetto 7.2",false,"prospetto 7.2'!$G$61",{"$f":"'prospetto 7.2'!$G$61","v":0}]
["7202200","$G$62","Prospetto 7.2",false,"prospetto 7.2'!$G$62",{"$f":"'prospetto 7.2'!$G$62","v":0}]
["7212400","$E$70","Prospetto 7.2",true,"prospetto 7.2'!$E$70",{"$f":"'prospetto 7.2'!$E$70","v":0}]
["7212500","$E$71","Prospetto 7.2",false,"prospetto 7.2'!$E$71",{"$f":"'prospetto 7.2'!$E$71","v":0}]
["7200100","$G$9","Prospetto 7.2",false,"prospetto 7.2'!$G$9",{"$f":"'prospetto 7.2'!$G$9","v":0}]
["7200200","$G$10","Prospetto 7.2",true,"prospetto 7.2'!$G$10",{"$f":"'prospetto 7.2'!$G$10","v":0}]
["7200300","$G$11","Prospetto 7.2",false,"prospetto 7.2'!$G$11",{"$f":"'prospetto 7.2'!$G$11","v":0}]
["7200400","$G$12","Prospetto 7.2",false,"prospetto 7.2'!$G$12",{"$f":"'prospetto 7.2'!$G$12","v":0}]
["7212100","$G$13","Prospetto 7.2",false,"prospetto 7.2'!$G$13",{"$f":"'prospetto 7.2'!$G$13","v":0}]
["7212600","$G$14","Prospetto 7.2",false,"prospetto 7.2'!$G$14",{"$f":"'prospetto 7.2'!$G$14","v":0}]
["7212700","$G$15","Prospetto 7.2",false,"prospetto 7.2'!$G$15",{"$f":"'prospetto 7.2'!$G$15","v":0}]
["7212800","$G$16","Prospetto 7.2",false,"prospetto 7.2'!$G$16",{"$f":"'prospetto 7.2'!$G$16","v":0}]
["7212900","$G$17","Prospetto 7.2",false,"prospetto 7.2'!$G$17",{"$f":"'prospetto 7.2'!$G$17","v":0}]
["7200500","$G$18","Prospetto 7.2",false,"prospetto 7.2'!$G$18",{"$f":"'prospetto 7.2'!$G$18","v":0}]
["7213000","$G$19","Prospetto 7.2",false,"prospetto 7.2'!$G$19",{"$f":"'prospetto 7.2'!$G$19","v":0}]
["7213100","$G$20","Prospetto 7.2",true,"prospetto 7.2'!$G$20",{"$f":"'prospetto 7.2'!$G$20","v":0}]
["7213200","$G$21","Prospetto 7.2",false,"prospetto 7.2'!$G$21",{"$f":"'prospetto 7.2'!$G$21","v":0}]
["7213300","$G$22","Prospetto 7.2",false,"prospetto 7.2'!$G$22",{"$f":"'prospetto 7.2'!$G$22","v":0}]
["7213400","$G$23","Prospetto 7.2",false,"prospetto 7.2'!$G$23",{"$f":"'prospetto 7.2'!$G$23","v":0}]
["7213500","$G$24","Prospetto 7.2",false,"prospetto 7.2'!$G$24",{"$f":"'prospetto 7.2'!$G$24","v":0}]
["7210800","$G$25","Prospetto 7.2",false,"prospetto 7.2'!$G$25",{"$f":"'prospetto 7.2'!$G$25","v":0}]
["7210900","$G$26","Prospetto 7.2",false,"prospetto 7.2'!$G$26",{"$f":"'prospetto 7.2'!$G$26","v":0}]
["7213600","$G$27","Prospetto 7.2",false,"prospetto 7.2'!$G$27",{"$f":"'prospetto 7.2'!$G$27","v":0}]
["7213700","$G$28","Prospetto 7.2",true,"prospetto 7.2'!$G$28",{"$f":"'prospetto 7.2'!$G$28","v":0}]
["7213800","$G$29","Prospetto 7.2",false,"prospetto 7.2'!$G$29",{"$f":"'prospetto 7.2'!$G$29","v":0}]
["7213900","$G$30","Prospetto 7.2",false,"prospetto 7.2'!$G$30",{"$f":"'prospetto 7.2'!$G$30","v":0}]
["7214000","$G$31","Prospetto 7.2",false,"prospetto 7.2'!$G$31",{"$f":"'prospetto 7.2'!$G$31","v":0}]
["7214100","$G$32","Prospetto 7.2",false,"prospetto 7.2'!$G$32",{"$f":"'prospetto 7.2'!$G$32","v":0}]
["7200600","$G$33","Prospetto 7.2",false,"prospetto 7.2'!$G$33",{"$f":"'prospetto 7.2'!$G$33","v":0}]
["7200700","$G$34","Prospetto 7.2",false,"prospetto 7.2'!$G$34",{"$f":"'prospetto 7.2'!$G$34","v":0}]
["7200800","$G$35","Prospetto 7.2",false,"prospetto 7.2'!$G$35",{"$f":"'prospetto 7.2'!$G$35","v":0}]
["7210100","$G$36","Prospetto 7.2",false,"prospetto 7.2'!$G$36",{"$f":"'prospetto 7.2'!$G$36","v":0}]
["7210200","$G$37","Prospetto 7.2",false,"prospetto 7.2'!$G$37",{"$f":"'prospetto 7.2'!$G$37","v":0}]
["7210300","$G$38","Prospetto 7.2",false,"prospetto 7.2'!$G$38",{"$f":"'prospetto 7.2'!$G$38","v":0}]
["7210400","$G$39","Prospetto 7.2",false,"prospetto 7.2'!$G$39",{"$f":"'prospetto 7.2'!$G$39","v":0}]
["7210500","$G$40","Prospetto 7.2",false,"prospetto 7.2'!$G$40",{"$f":"'prospetto 7.2'!$G$40","v":0}]
["7202400","$G$41","Prospetto 7.2",false,"prospetto 7.2'!$G$41",{"$f":"'prospetto 7.2'!$G$41","v":0}]
["7201000","$G$42","Prospetto 7.2",false,"prospetto 7.2'!$G$42",{"$f":"'prospetto 7.2'!$G$42","v":0}]
["7201100","$G$43","Prospetto 7.2",false,"prospetto 7.2'!$G$43",{"$f":"'prospetto 7.2'!$G$43","v":0}]
["7202600","$G$44","Prospetto 7.2",false,"prospetto 7.2'!$G$44",{"$f":"'prospetto 7.2'!$G$44","v":0}]
["7210700","$G$45","Prospetto 7.2",false,"prospetto 7.2'!$G$45",{"$f":"'prospetto 7.2'!$G$45","v":0}]
["7201200","$G$46","Prospetto 7.2",false,"prospetto 7.2'!$G$46",{"$f":"'prospetto 7.2'!$G$46","v":0}]
["7202700","$G$47","Prospetto 7.2",false,"prospetto 7.2'!$G$47",{"$f":"'prospetto 7.2'!$G$47","v":0}]
["7201400","$G$48","Prospetto 7.2",false,"prospetto 7.2'!$G$48",{"$f":"'prospetto 7.2'!$G$48","v":0}]
["7211900","$G$49","Prospetto 7.2",false,"prospetto 7.2'!$G$49",{"$f":"'prospetto 7.2'!$G$49","v":0}]
["7212000","$G$50","Prospetto 7.2",false,"prospetto 7.2'!$G$50",{"$f":"'prospetto 7.2'!$G$50","v":0}]
["7202800","$I$9","Prospetto 7.2",false,"prospetto 7.2'!$I$9",{"$f":"'prospetto 7.2'!$I$9","v":0}]
["7202900","$I$10","Prospetto 7.2",true,"prospetto 7.2'!$I$10",{"$f":"'prospetto 7.2'!$I$10","v":0}]
["7203000","$I$11","Prospetto 7.2",false,"prospetto 7.2'!$I$11",{"$f":"'prospetto 7.2'!$I$11","v":0}]
["7212200","$I$49","Prospetto 7.2",false,"prospetto 7.2'!$I$49",{"$f":"'prospetto 7.2'!$I$49","v":0}]
["7212300","$I$50","Prospetto 7.2",false,"prospetto 7.2'!$I$50",{"$f":"'prospetto 7.2'!$I$50","v":0}]
["7211700","$I$25","Prospetto 7.2",false,"prospetto 7.2'!$I$25",{"$f":"'prospetto 7.2'!$I$25","v":0}]
["7211800","$I$26","Prospetto 7.2",false,"prospetto 7.2'!$I$26",{"$f":"'prospetto 7.2'!$I$26","v":0}]